Report ID,CAERS Created Date,Date of Event,Product Type,Product,Product Code,Description,Patient Age,Age Units,Sex,MedDRA Preferred Terms,Outcomes
65335,1/1/2004,11/24/2003,SUSPECT,ENFAMIL LIPIL BABY FORMULA,40, Baby Food Products,3,month(s),,"VOMITING, GASTROINTESTINAL DISORDER",Other Outcome
65345,1/1/2004,12/21/2003,SUSPECT,"FRITO LAY FUNYUNS ONION FLAVOR, ONION RINGS",7, Snack Food Item,10,year(s),M,CHOKING,Other Outcome
65350,1/1/2004,,SUSPECT,GRAPE,20, Fruit/Fruit Prod,,,,"DEATH, CHOKING",Death
65336,1/1/2004,,SUSPECT,ENFIMIL LIPIL BABY FORMULA,40, Baby Food Products,,,,"PHYSICAL EXAMINATION, GASTROINTESTINAL DISORDER",Patient Visited Healthcare Provider
65333,1/1/2004,,SUSPECT,KROGER CLASSIC CREAM-DE-MINT CANDY MINT CHIP ICE CREAM,13, Ice Cream Prod,,,,"NAUSEA, DYSGEUSIA, DIARRHOEA",Patient Visited ER
65325,1/1/2004,8/4/2003,SUSPECT,MIDWEST COUNTRY FAIR CHOCOLATE FLAVORED CHIPS,3, Bakery Prod/Dough/Mix/Icing,2,year(s),F,"WHEEZING, SWELLING FACE, RASH, HOSPITALISATION, DYSPNOEA, COUGH","Hospitalization, Patient Visited Healthcare Provider, Patient Visited ER, Required Intervention"
65354,1/2/2004,,SUSPECT,YOHIMBE,54, Vit/Min/Prot/Unconv Diet(Human/Animal),66,year(s),M,BLOOD PRESSURE INCREASED,Required Intervention
65357,1/2/2004,10/27/2003,SUSPECT,CAL-C PEACH TROPIC ENRICHED BEVERAGE BLEND,29, Soft Drink/Water,,,,"VOMITING, RASH, MALAISE, LOOSE STOOLS, DIARRHOEA, ABDOMINAL PAIN UPPER, ABDOMINAL PAIN",Other Outcome
65355,1/2/2004,10/27/2003,SUSPECT,CAL-C PEACH TROPIC ENRICHED BEVERAGE BLEND,29, Soft Drink/Water,,,,"VOMITING, RASH, PHYSICAL EXAMINATION, OROPHARYNGEAL SWELLING, MALAISE, LOOSE STOOLS, FLUSHING, FAECES PALE, DIARRHOEA, ABDOMINAL PAIN",Other Outcome
65353,1/2/2004,12/1/2003,SUSPECT,HERBALIFE TOTAL CONTROL,54, Vit/Min/Prot/Unconv Diet(Human/Animal),,,,"PHYSICAL EXAMINATION, PARANOIA, DELUSION",Patient Visited Healthcare Provider
65356,1/2/2004,10/27/2003,SUSPECT,CAL-C PEACH TROPIC ENRICHED BEVERAGE BLEND,29, Soft Drink/Water,,,,"VOMITING, RASH, LOOSE STOOLS, ABDOMINAL PAIN UPPER, ABDOMINAL PAIN",Other Outcome
65353,1/2/2004,12/1/2003,SUSPECT,HERBALIFE RELAX NOW,54, Vit/Min/Prot/Unconv Diet(Human/Animal),,,,"PHYSICAL EXAMINATION, PARANOIA, DELUSION",Patient Visited Healthcare Provider
65387,1/3/2004,,SUSPECT,H.P. HOOD HALF AND HALF,9, Milk/Butter/Dried Milk Prod,,,,PHARYNGITIS,Other Outcome
65388,1/3/2004,12/30/2003,SUSPECT,LACTAID REDUCED FAT (2%) MILK 100% LACTOSE FREE,9, Milk/Butter/Dried Milk Prod,,,,VOMITING,Other Outcome
65379,1/3/2004,,SUSPECT,I CONTACT LIP-INK (SEMI-PERMANENT),53, Cosmetics,,,,"SWELLING FACE, PARAESTHESIA ORAL",Other Outcome
65399,1/5/2004,11/22/2003,SUSPECT,METOBOLITE 356,54, Vit/Min/Prot/Unconv Diet(Human/Animal),51,year(s),M,"STRESS SYMPTOMS, DEATH, COMPLETED SUICIDE",Death
65404,1/5/2004,,SUSPECT,ENIVA MINERALS FOR LIFE-SILVER,54, Vit/Min/Prot/Unconv Diet(Human/Animal),16,year(s),M,"SKIN DISCOLOURATION, MUCOSAL DISCOLOURATION",Patient Visited Healthcare Provider
65403,1/5/2004,3/4/2003,SUSPECT,METABOLIFE METABOLIFE,54, Vit/Min/Prot/Unconv Diet(Human/Animal),54,year(s),F,CEREBROVASCULAR ACCIDENT,"Life Threatening, Hospitalization, Patient Visited Healthcare Provider, Patient Visited ER"
65400,1/5/2004,9/5/2001,SUSPECT,METABOLIFE,54, Vit/Min/Prot/Unconv Diet(Human/Animal),45,year(s),F,"MITRAL VALVE INCOMPETENCE, DEATH","Death, Patient Visited Healthcare Provider"
65421,1/6/2004,8/21/2003,SUSPECT,GATORADE SPORTS DRINK,29, Soft Drink/Water,14,year(s),M,ALOPECIA,Other Outcome
65438,1/6/2004,11/1/2003,SUSPECT,COFFEE,31, Coffee/Tea,,,,"VENTRICULAR EXTRASYSTOLES, TINNITUS, PHYSICAL EXAMINATION, PARAESTHESIA, PALPITATIONS, ORTHOSTATIC HYPOTENSION, HYPERSENSITIVITY, HOSPITALISATION, HOSPITALISATION, EXTRASYSTOLES, EAR, NOSE AND THROAT EXAMINATION, DIZZINESS, CHEST PAIN, BLOOD PRESSURE INCREASED, BALANCE DISORDER, ARRHYTHMIA","Life Threatening, Disability"
65424,1/6/2004,,SUSPECT,RIPPED FUEL,54, Vit/Min/Prot/Unconv Diet(Human/Animal),33,year(s),F,"TREMOR, FACIAL PALSY","Patient Visited Healthcare Provider, Required Intervention"
65425,1/6/2004,,SUSPECT,SIBERIAN GINSENG,54, Vit/Min/Prot/Unconv Diet(Human/Animal),29,year(s),M,"DIZZINESS, BODY TEMPERATURE INCREASED",Patient Visited Healthcare Provider
65426,1/6/2004,11/6/1998,SUSPECT,EPHEDRA,54, Vit/Min/Prot/Unconv Diet(Human/Animal),43,year(s),M,"MYOCARDIAL INFARCTION, HOSPITALISATION","Life Threatening, Hospitalization, Disability"
65427,1/6/2004,,SUSPECT,METABOLIFE,54, Vit/Min/Prot/Unconv Diet(Human/Animal),27,year(s),F,PERIPHERAL VASCULAR DISORDER,Patient Visited Healthcare Provider
65427,1/6/2004,,SUSPECT,PRODUCTS CONTAINING EPHEDRA,54, Vit/Min/Prot/Unconv Diet(Human/Animal),27,year(s),F,PERIPHERAL VASCULAR DISORDER,Patient Visited Healthcare Provider
65430,1/6/2004,,SUSPECT,EPHEDRINE MULTI-ACTION,54, Vit/Min/Prot/Unconv Diet(Human/Animal),42,year(s),M,"COUGH, CHEST PAIN",Other Outcome
65431,1/6/2004,,SUSPECT,STACKER 3 WITH CHITOSAN EPHEDRA FREE FORMULA,54, Vit/Min/Prot/Unconv Diet(Human/Animal),40,year(s),F,"TREMOR, LOSS OF CONSCIOUSNESS, HYPOTENSION, HEART RATE INCREASED, FEELING COLD, FEELING ABNORMAL, DIZZINESS, DEHYDRATION, ABDOMINAL PAIN UPPER",Patient Visited Healthcare Provider
65432,1/6/2004,12/5/2003,SUSPECT,ZANTREX 3,54, Vit/Min/Prot/Unconv Diet(Human/Animal),51,year(s),F,"PARAESTHESIA, FLUSHING, ERYTHEMA",Patient Visited ER
65433,1/6/2004,7/1/2002,SUSPECT,XENADRINE,54, Vit/Min/Prot/Unconv Diet(Human/Animal),35,year(s),F,"TENDERNESS, PAIN, HEADACHE, HEADACHE",Other Outcome
65435,1/6/2004,12/31/2003,SUSPECT,ROMA PIZZA,37, Mult Food Dinner/Grav/Sauce/Special,19,year(s),M,FOOD POISONING,Other Outcome
65439,1/6/2004,12/15/2003,SUSPECT,DORMANS SWISS CHEESE,12, Cheese/Cheese Prod,4,year(s),F,MALAISE,Other Outcome
65440,1/6/2004,10/28/2003,SUSPECT,HERBS FOR LIFE GHR-GOLDALL NATURAL GROWTH HORMONE RELEASER NUTRITIONAL SUPPLEMENT,54, Vit/Min/Prot/Unconv Diet(Human/Animal),73,year(s),M,"HOSPITALISATION, DEATH, CREUTZFELDT-JAKOB DISEASE","Death, Life Threatening, Hospitalization, Patient Visited Healthcare Provider"
65468,1/6/2004,12/15/2003,SUSPECT,JELLO OREO PUDDING SNACKS,35, Gelatin/Rennet/Pudding Mix/Pie Filling,10,year(s),M,"VOMITING, MALAISE, DIARRHOEA, ABDOMINAL PAIN",Other Outcome
65416,1/6/2004,11/15/2003,SUSPECT,AVLIMIL,54, Vit/Min/Prot/Unconv Diet(Human/Animal),36,year(s),F,"PALPITATIONS, HEART RATE INCREASED, DIZZINESS, BLOOD PRESSURE INCREASED",Patient Visited Healthcare Provider
65419,1/6/2004,,SUSPECT,AVLIMIL,54, Vit/Min/Prot/Unconv Diet(Human/Animal),48,year(s),F,PAIN IN EXTREMITY,Other Outcome
65420,1/6/2004,11/1/2003,SUSPECT,DIET COKE,29, Soft Drink/Water,33,year(s),M,"VENTRICULAR EXTRASYSTOLES, PHYSICAL EXAMINATION, PARAESTHESIA, PALPITATIONS, ORTHOSTATIC HYPOTENSION, HOSPITALISATION, EXTRASYSTOLES, DIZZINESS, CHEST PAIN","Life Threatening, Hospitalization, Disability"
65420,1/6/2004,11/1/2003,SUSPECT,LISTERINE STRIPS,53, Cosmetics,33,year(s),M,"VENTRICULAR EXTRASYSTOLES, PHYSICAL EXAMINATION, PARAESTHESIA, PALPITATIONS, ORTHOSTATIC HYPOTENSION, HOSPITALISATION, EXTRASYSTOLES, DIZZINESS, CHEST PAIN","Life Threatening, Hospitalization, Disability"
65420,1/6/2004,11/1/2003,SUSPECT,DIET PEPSI,29, Soft Drink/Water,33,year(s),M,"VENTRICULAR EXTRASYSTOLES, PHYSICAL EXAMINATION, PARAESTHESIA, PALPITATIONS, ORTHOSTATIC HYPOTENSION, HOSPITALISATION, EXTRASYSTOLES, DIZZINESS, CHEST PAIN","Life Threatening, Hospitalization, Disability"
65420,1/6/2004,11/1/2003,SUSPECT,DIET SPRITE,29, Soft Drink/Water,33,year(s),M,"VENTRICULAR EXTRASYSTOLES, PHYSICAL EXAMINATION, PARAESTHESIA, PALPITATIONS, ORTHOSTATIC HYPOTENSION, HOSPITALISATION, EXTRASYSTOLES, DIZZINESS, CHEST PAIN","Life Threatening, Hospitalization, Disability"
65420,1/6/2004,11/1/2003,SUSPECT,NUTRASWEET,45, Food Additives (Human Use),33,year(s),M,"VENTRICULAR EXTRASYSTOLES, PHYSICAL EXAMINATION, PARAESTHESIA, PALPITATIONS, ORTHOSTATIC HYPOTENSION, HOSPITALISATION, EXTRASYSTOLES, DIZZINESS, CHEST PAIN","Life Threatening, Hospitalization, Disability"
65420,1/6/2004,11/1/2003,SUSPECT,JAMS,22, Fruit/Fruit Prod,33,year(s),M,"VENTRICULAR EXTRASYSTOLES, PHYSICAL EXAMINATION, PARAESTHESIA, PALPITATIONS, ORTHOSTATIC HYPOTENSION, HOSPITALISATION, EXTRASYSTOLES, DIZZINESS, CHEST PAIN","Life Threatening, Hospitalization, Disability"
65420,1/6/2004,11/1/2003,SUSPECT,PUDDINGS,35, Gelatin/Rennet/Pudding Mix/Pie Filling,33,year(s),M,"VENTRICULAR EXTRASYSTOLES, PHYSICAL EXAMINATION, PARAESTHESIA, PALPITATIONS, ORTHOSTATIC HYPOTENSION, HOSPITALISATION, EXTRASYSTOLES, DIZZINESS, CHEST PAIN","Life Threatening, Hospitalization, Disability"
65420,1/6/2004,11/1/2003,SUSPECT,DIET CAFFEINE FREE COKE,29, Soft Drink/Water,33,year(s),M,"VENTRICULAR EXTRASYSTOLES, PHYSICAL EXAMINATION, PARAESTHESIA, PALPITATIONS, ORTHOSTATIC HYPOTENSION, HOSPITALISATION, EXTRASYSTOLES, DIZZINESS, CHEST PAIN","Life Threatening, Hospitalization, Disability"
65420,1/6/2004,11/1/2003,SUSPECT,TEA,31, Coffee/Tea,33,year(s),M,"VENTRICULAR EXTRASYSTOLES, PHYSICAL EXAMINATION, PARAESTHESIA, PALPITATIONS, ORTHOSTATIC HYPOTENSION, HOSPITALISATION, EXTRASYSTOLES, DIZZINESS, CHEST PAIN","Life Threatening, Hospitalization, Disability"
65420,1/6/2004,11/1/2003,SUSPECT,COFFEE,31, Coffee/Tea,33,year(s),M,"VENTRICULAR EXTRASYSTOLES, PHYSICAL EXAMINATION, PARAESTHESIA, PALPITATIONS, ORTHOSTATIC HYPOTENSION, HOSPITALISATION, EXTRASYSTOLES, DIZZINESS, CHEST PAIN","Life Threatening, Hospitalization, Disability"
65421,1/6/2004,8/21/2003,SUSPECT,DIET COKE,29, Soft Drink/Water,14,year(s),M,ALOPECIA,Other Outcome
65421,1/6/2004,8/21/2003,SUSPECT,TOOTHPASTE,53, Cosmetics,14,year(s),M,ALOPECIA,Other Outcome
65457,1/6/2004,11/22/2003,SUSPECT,VICENZI NOCCIOLA (COOKIES),3, Bakery Prod/Dough/Mix/Icing,,,,ORAL DISCOMFORT,"Patient Visited Healthcare Provider, Patient Visited ER"
65473,1/6/2004,1/3/2004,SUSPECT,SNAPPLE DIET LEMON ICED TEA,31, Coffee/Tea,,,,"VOMITING, MALAISE, GASTROINTESTINAL DISORDER, DIARRHOEA, DEFAECATION URGENCY",Patient Visited Healthcare Provider
65437,1/6/2004,12/31/2003,SUSPECT,ROMA PIZZA,37, Mult Food Dinner/Grav/Sauce/Special,,,,FOOD POISONING,Other Outcome
65465,1/6/2004,,SUSPECT,YEO HIAP SENG (M) BHD YEO'S SOYA BEAN DRINK VIETAMESE STYLE,24, Vegetables/Vegetable Products,,,,HAEMATOCHEZIA,Patient Visited Healthcare Provider
65423,1/6/2004,1/1/1996,SUSPECT,BREATHE EASY TEA,54, Vit/Min/Prot/Unconv Diet(Human/Animal),,,,"PSYCHOTIC DISORDER, PARANOIA, PALPITATIONS, HYPERVENTILATION",Other Outcome
65436,1/6/2004,12/31/2003,SUSPECT,ROMA PIZZA,37, Mult Food Dinner/Grav/Sauce/Special,,,,FOOD POISONING,Other Outcome
65443,1/6/2004,3/7/2003,SUSPECT,MARUCHAN CREAMY PESTO INSTANT LUNCH NOODLES,4, Macaroni/Noodle Prod,,,,"NAUSEA, MALAISE, DIZZINESS, ASTHENIA",Other Outcome
65450,1/6/2004,4/7/2003,SUSPECT,SUNSWEET PRUNES,21, Fruit/Fruit Prod,,,,ABDOMINAL PAIN UPPER,Other Outcome
65438,1/6/2004,11/1/2003,SUSPECT,NUTRASWEET,45, Food Additives (Human Use),,,,"VENTRICULAR EXTRASYSTOLES, TINNITUS, PHYSICAL EXAMINATION, PARAESTHESIA, PALPITATIONS, ORTHOSTATIC HYPOTENSION, HYPERSENSITIVITY, HOSPITALISATION, HOSPITALISATION, EXTRASYSTOLES, EAR, NOSE AND THROAT EXAMINATION, DIZZINESS, CHEST PAIN, BLOOD PRESSURE INCREASED, BALANCE DISORDER, ARRHYTHMIA","Life Threatening, Disability"
65438,1/6/2004,11/1/2003,SUSPECT,DIET COKE,29, Soft Drink/Water,,,,"VENTRICULAR EXTRASYSTOLES, TINNITUS, PHYSICAL EXAMINATION, PARAESTHESIA, PALPITATIONS, ORTHOSTATIC HYPOTENSION, HYPERSENSITIVITY, HOSPITALISATION, HOSPITALISATION, EXTRASYSTOLES, EAR, NOSE AND THROAT EXAMINATION, DIZZINESS, CHEST PAIN, BLOOD PRESSURE INCREASED, BALANCE DISORDER, ARRHYTHMIA","Life Threatening, Disability"
65438,1/6/2004,11/1/2003,SUSPECT,JAMS,22, Fruit/Fruit Prod,,,,"VENTRICULAR EXTRASYSTOLES, TINNITUS, PHYSICAL EXAMINATION, PARAESTHESIA, PALPITATIONS, ORTHOSTATIC HYPOTENSION, HYPERSENSITIVITY, HOSPITALISATION, HOSPITALISATION, EXTRASYSTOLES, EAR, NOSE AND THROAT EXAMINATION, DIZZINESS, CHEST PAIN, BLOOD PRESSURE INCREASED, BALANCE DISORDER, ARRHYTHMIA","Life Threatening, Disability"
65438,1/6/2004,11/1/2003,SUSPECT,PUDDINGS,35, Gelatin/Rennet/Pudding Mix/Pie Filling,,,,"VENTRICULAR EXTRASYSTOLES, TINNITUS, PHYSICAL EXAMINATION, PARAESTHESIA, PALPITATIONS, ORTHOSTATIC HYPOTENSION, HYPERSENSITIVITY, HOSPITALISATION, HOSPITALISATION, EXTRASYSTOLES, EAR, NOSE AND THROAT EXAMINATION, DIZZINESS, CHEST PAIN, BLOOD PRESSURE INCREASED, BALANCE DISORDER, ARRHYTHMIA","Life Threatening, Disability"
65438,1/6/2004,11/1/2003,SUSPECT,DIET CAFFEINE FREE COKE,29, Soft Drink/Water,,,,"VENTRICULAR EXTRASYSTOLES, TINNITUS, PHYSICAL EXAMINATION, PARAESTHESIA, PALPITATIONS, ORTHOSTATIC HYPOTENSION, HYPERSENSITIVITY, HOSPITALISATION, HOSPITALISATION, EXTRASYSTOLES, EAR, NOSE AND THROAT EXAMINATION, DIZZINESS, CHEST PAIN, BLOOD PRESSURE INCREASED, BALANCE DISORDER, ARRHYTHMIA","Life Threatening, Disability"
65422,1/6/2004,5/24/2003,SUSPECT,FLEXIUM SAM-E,54, Vit/Min/Prot/Unconv Diet(Human/Animal),59,year(s),F,"PHYSICAL EXAMINATION, HYPOTRICHOSIS, HYPERSENSITIVITY, HYPERSENSITIVITY, HYPERSENSITIVITY, HEADACHE, DERMATOLOGIC EXAMINATION, ARTHRALGIA, ALOPECIA, ALOPECIA",Patient Visited Healthcare Provider
65491,1/7/2004,12/23/2002,SUSPECT,SUNDOWN SAW PALMETTO,54, Vit/Min/Prot/Unconv Diet(Human/Animal),65,year(s),M,"HOSPITALISATION, EPISTAXIS","Life Threatening, Patient Visited Healthcare Provider, Patient Visited ER"
65487,1/7/2004,,SUSPECT,ENSURE DRINK,41, Dietary Conventional Foods/Meal Replacements,,,,"HEADACHE, FLATULENCE, DIARRHOEA, ABDOMINAL PAIN",Other Outcome
65497,1/7/2004,7/17/2003,SUSPECT,FRITO LAY WAVY RANCH POTATO CHIPS,7, Snack Food Item,,,,"VOMITING, MALAISE, HYPERHIDROSIS",Patient Visited Healthcare Provider
65489,1/7/2004,11/23/2003,SUSPECT,REESE'S FAST BREAK PEANUT BUTTER AND NOUGAT CHOCOLATE BAR,34, Choc/Cocoa Prod,,,,NAUSEA,Other Outcome
65486,1/7/2004,,SUSPECT,TOPS BRAND FROSTED FLAKES (CORN FLAKES),5, Cereal Prep/Breakfast Food,,,,"PARAESTHESIA, HYPOAESTHESIA ORAL, DIARRHOEA",Other Outcome
65532,1/8/2004,,SUSPECT,COCA-COLA VANILLA COKE,29, Soft Drink/Water,15,year(s),F,ABDOMINAL PAIN UPPER,Other Outcome
65519,1/8/2004,11/12/2003,SUSPECT,GRILYAZZH RASPBERRY CANDY NUTS,33, Candy W/O Choc/Special/Chew Gum,,,,HYPERSENSITIVITY,Other Outcome
65510,1/8/2004,,SUSPECT,CAPRI SUN FRUIT PUNCH,21, Fruit/Fruit Prod,9,year(s),F,DYSPEPSIA,Other Outcome
65513,1/8/2004,,SUSPECT,JADRANKA TRADITIONAL PASTEURIZED RED PEPPERS,24, Vegetables/Vegetable Products,59,year(s),F,"VOMITING, VISUAL DISTURBANCE, SALIVARY HYPERSECRETION, MOOD ALTERED, HEADACHE, FATIGUE, DIARRHOEA, ASTHENIA, ANXIETY",Other Outcome
65517,1/8/2004,11/3/2003,SUSPECT,SOY BITE COOKIE (SOYBEAN),3, Bakery Prod/Dough/Mix/Icing,,,,DIARRHOEA,Other Outcome
65523,1/8/2004,11/12/2003,SUSPECT,LANCE TOAST CHEESE SNACK CRACKERS,3, Bakery Prod/Dough/Mix/Icing,,,,"PHYSICAL EXAMINATION, HEADACHE, DIARRHOEA, ABDOMINAL PAIN UPPER",Patient Visited ER
65533,1/8/2004,12/2/2003,SUSPECT,POLAND SPRINGS SPRING WATER,29, Soft Drink/Water,,,,"RIGORS, NAUSEA, DIARRHOEA, ABDOMINAL PAIN",Other Outcome
65529,1/8/2004,,SUSPECT,DEAD SEA RUM FACIAL CREAM,53, Cosmetics,,,,"SKIN DISCOLOURATION, ERYTHEMA, ERYTHEMA, BURNING SENSATION",Other Outcome
65509,1/8/2004,6/16/2003,SUSPECT,POPSICLES SPIDERMAN FIRECRACKER SUPER HEROES POPSICLES,13, Ice Cream Prod,,,,CHOKING,Other Outcome
65516,1/8/2004,,SUSPECT,AVACOR NUTRA CAP TABLETS,54, Vit/Min/Prot/Unconv Diet(Human/Animal),,,,"UNEXPECTED THERAPEUTIC DRUG EFFECT, TRICHORRHEXIS, HYPOTRICHOSIS",Other Outcome
65516,1/8/2004,,SUSPECT,AVACOR SHAMPOO,53, Cosmetics,,,,"UNEXPECTED THERAPEUTIC DRUG EFFECT, TRICHORRHEXIS, HYPOTRICHOSIS",Other Outcome
65520,1/8/2004,,SUSPECT,BALANCE BAR CHOCOLATE CRUNCH,7, Snack Food Item,,,,DIARRHOEA,Other Outcome
65518,1/8/2004,,SUSPECT,MCCORMICK SALAD TOPPINS,23, Nuts/Edible Seed,,,,"TREMOR, HYPERSENSITIVITY, HYPERHIDROSIS, FEELING COLD, DYSPNOEA","Patient Visited ER, Required Intervention"
65528,1/8/2004,12/14/2003,SUSPECT,M AND M PEANUT CANDIES,34, Choc/Cocoa Prod,,,,"NAUSEA, MYALGIA, DIARRHOEA, ASTHENIA",Patient Visited Healthcare Provider
65521,1/8/2004,11/19/2003,SUSPECT,BAKER'S OVEN PUMPKIN PIE,35, Gelatin/Rennet/Pudding Mix/Pie Filling,,,,"RIGORS, PAIN, HYPERHIDROSIS, DIARRHOEA",Other Outcome
65508,1/8/2004,,SUSPECT,POST WAFFLE CRISP,5, Cereal Prep/Breakfast Food,2,year(s),F,"VOMITING, DYSPEPSIA, DIARRHOEA","Patient Visited Healthcare Provider, Patient Visited ER"
65546,1/9/2004,,SUSPECT,BUNNY LOVE FRESH BABY CARROTS,25, Vegetables/Vegetable Products,66,year(s),F,"VISION BLURRED, THROAT TIGHTNESS, SNEEZING, SINUS PAIN, HOSPITALISATION, EYE PRURITUS, EYE OEDEMA, EYE IRRITATION, EMERGENCY CARE EXAMINATION, DYSPNOEA","Hospitalization, Patient Visited Healthcare Provider, Patient Visited ER"
65549,1/9/2004,11/2/2003,SUSPECT,MISTIC SPARKLING LIME KIWI WATER,29, Soft Drink/Water,28,year(s),F,"NAUSEA, HOSPITALISATION, DRY THROAT, BURNING SENSATION, ABDOMINAL PAIN UPPER","Hospitalization, Patient Visited ER"
65553,1/9/2004,12/3/2003,SUSPECT,OTIS SPUNKMEYERS BANANA NUT MUFFINS,3, Bakery Prod/Dough/Mix/Icing,13,year(s),F,"THROAT IRRITATION, NAUSEA",Patient Visited Healthcare Provider
65569,1/9/2004,,SUSPECT,SUBWAY CHICKEN WRAP SANDWICH,37, Mult Food Dinner/Grav/Sauce/Special,17,year(s),F,"SWELLING FACE, HYPERSENSITIVITY, ERYTHEMA, EMERGENCY CARE EXAMINATION, DYSPNOEA, BLOOD PRESSURE DECREASED","Patient Visited ER, Required Intervention"
65554,1/9/2004,,SUSPECT,BUTTER FINGERS PEANUT BUTTER CANDIES,34, Choc/Cocoa Prod,,,,"NAUSEA, ABDOMINAL PAIN",Patient Visited Healthcare Provider
65570,1/9/2004,,SUSPECT,MAYONNAISE,27, Dressing/Condiment,,,,"VOMITING, NAUSEA, FLATULENCE, DIARRHOEA, CHEST PAIN, ABDOMINAL DISTENSION",Other Outcome
65555,1/9/2004,12/4/2003,SUSPECT,HARRY AND DAVID'S RASPBERRY CHOCOLATE COVERED TRUFFLES,34, Choc/Cocoa Prod,,,,"VOMITING, URTICARIA, THROAT IRRITATION, MEDICATION ERROR, CHEST PAIN, ABDOMINAL PAIN",Patient Visited Healthcare Provider
65557,1/9/2004,11/1/2003,SUSPECT,VITA SHRIMP COCKTAIL,16, Fishery/Seafood Prod,,,,"LOOSE STOOLS, FLATULENCE",Other Outcome
65559,1/9/2004,,SUSPECT,SKIPPY SKIPPY SQUEEZE IT,23, Nuts/Edible Seed,,,,"VOMITING, MALAISE, HOSPITALISATION","Hospitalization, Patient Visited ER"
65545,1/9/2004,6/3/2003,SUSPECT,V8 VEGETABLE JUICE,24, Vegetables/Vegetable Products,,,,"VOMITING, DIARRHOEA",Patient Visited Healthcare Provider
65578,1/10/2004,1/1/2003,SUSPECT,SALLY HANSEN BRUSH-ON BIKINI HAIR REMOVER CREAM,53, Cosmetics,25,year(s),F,"SKIN BURNING SENSATION, SKIN BLEEDING, PHYSICAL EXAMINATION, ERYTHEMA, BURNS SECOND DEGREE, BLISTER",Patient Visited Healthcare Provider
65596,1/10/2004,12/16/2003,SUSPECT,M AND M PEANUT CANDY,33, Candy W/O Choc/Special/Chew Gum,,,,VOMITING,Other Outcome
65597,1/10/2004,,SUSPECT,KELLOGG'S FRUIT AND HARVEST CEREAL,5, Cereal Prep/Breakfast Food,,,,"PHARYNGITIS, CAUSTIC INJURY",Other Outcome
65580,1/10/2004,3/31/2003,SUSPECT,"CAMELOT WATER, SPRING",29, Soft Drink/Water,,,,ABDOMINAL PAIN,Other Outcome
65595,1/10/2004,12/24/2003,SUSPECT,GIANT EAGLE 100% APPLE JUICE FROM CONCENTRATE,20, Fruit/Fruit Prod,,,,"PYREXIA, PHARYNGOLARYNGEAL PAIN, NASAL CONGESTION, HEADACHE",Other Outcome
65594,1/10/2004,,SUSPECT,WESTERN FAMILY 18 ASSORTED FLAVOR TWIN POPS,13, Ice Cream Prod,,,,HYPOAESTHESIA ORAL,Other Outcome
65598,1/10/2004,,SUSPECT,DOLE APPLE JUICE,20, Fruit/Fruit Prod,,,,MALAISE,Other Outcome
65610,1/11/2004,,SUSPECT,LUNA NUTS OVER CHOCOLATE ENERGY BAR,7, Snack Food Item,,,,"NAUSEA, DIARRHOEA",Other Outcome
65611,1/11/2004,6/30/2003,SUSPECT,HERSHEY'S CHOCOLATE BARS,34, Choc/Cocoa Prod,,,,VOMITING,Patient Visited ER
65613,1/11/2004,7/7/2003,SUSPECT,GREEN GIANT SPINACH WITH NO SAUCE,24, Vegetables/Vegetable Products,,,,NAUSEA,Other Outcome
65615,1/12/2004,12/2/2003,SUSPECT,POLAND SPRINGS SPRING WATER,29, Soft Drink/Water,4,year(s),F,"RIGORS, NAUSEA, MALAISE, DIARRHOEA, ABDOMINAL PAIN",Other Outcome
65616,1/12/2004,9/21/2003,SUSPECT,GOOD DAY 1% LOWFAT MILK,9, Milk/Butter/Dried Milk Prod,,,,PARAESTHESIA ORAL,Other Outcome
65619,1/12/2004,12/22/2003,SUSPECT,CALCIUM CALTRATE,54, Vit/Min/Prot/Unconv Diet(Human/Animal),70,year(s),M,"PHYSICAL EXAMINATION, LETHARGY, IMPAIRED DRIVING ABILITY, DIZZINESS, DEPRESSED MOOD, ASTHENIA",Disability
65619,1/12/2004,12/22/2003,SUSPECT,VITAMIN E,54, Vit/Min/Prot/Unconv Diet(Human/Animal),70,year(s),M,"PHYSICAL EXAMINATION, LETHARGY, IMPAIRED DRIVING ABILITY, DIZZINESS, DEPRESSED MOOD, ASTHENIA",Disability
65619,1/12/2004,12/22/2003,SUSPECT,MULTIVITAMIN,54, Vit/Min/Prot/Unconv Diet(Human/Animal),70,year(s),M,"PHYSICAL EXAMINATION, LETHARGY, IMPAIRED DRIVING ABILITY, DIZZINESS, DEPRESSED MOOD, ASTHENIA",Disability
65619,1/12/2004,12/22/2003,SUSPECT,ACEYTL-L-CARNITINE,54, Vit/Min/Prot/Unconv Diet(Human/Animal),70,year(s),M,"PHYSICAL EXAMINATION, LETHARGY, IMPAIRED DRIVING ABILITY, DIZZINESS, DEPRESSED MOOD, ASTHENIA",Disability
65619,1/12/2004,12/22/2003,SUSPECT,ALPHA LIPOIC,54, Vit/Min/Prot/Unconv Diet(Human/Animal),70,year(s),M,"PHYSICAL EXAMINATION, LETHARGY, IMPAIRED DRIVING ABILITY, DIZZINESS, DEPRESSED MOOD, ASTHENIA",Disability
65622,1/12/2004,6/26/2003,SUSPECT,EPHEDRA,54, Vit/Min/Prot/Unconv Diet(Human/Animal),54,year(s),F,"TACHYCARDIA, PALPITATIONS, PALPITATIONS, MUSCLE INJURY, HEART RATE INCREASED, HEART RATE INCREASED, FEELING ABNORMAL","Life Threatening, Patient Visited Healthcare Provider, Required Intervention"
65622,1/12/2004,6/26/2003,CONCOMITANT,ONE A DAY MULTIVITAMIN,54, Vit/Min/Prot/Unconv Diet(Human/Animal),54,year(s),F,"TACHYCARDIA, PALPITATIONS, PALPITATIONS, MUSCLE INJURY, HEART RATE INCREASED, HEART RATE INCREASED, FEELING ABNORMAL","Life Threatening, Patient Visited Healthcare Provider, Required Intervention"
65622,1/12/2004,6/26/2003,CONCOMITANT,PRIMROSE OIL,54, Vit/Min/Prot/Unconv Diet(Human/Animal),54,year(s),F,"TACHYCARDIA, PALPITATIONS, PALPITATIONS, MUSCLE INJURY, HEART RATE INCREASED, HEART RATE INCREASED, FEELING ABNORMAL","Life Threatening, Patient Visited Healthcare Provider, Required Intervention"
65622,1/12/2004,6/26/2003,CONCOMITANT,VITAMIN E,54, Vit/Min/Prot/Unconv Diet(Human/Animal),54,year(s),F,"TACHYCARDIA, PALPITATIONS, PALPITATIONS, MUSCLE INJURY, HEART RATE INCREASED, HEART RATE INCREASED, FEELING ABNORMAL","Life Threatening, Patient Visited Healthcare Provider, Required Intervention"
65622,1/12/2004,6/26/2003,CONCOMITANT,CALCIUM,54, Vit/Min/Prot/Unconv Diet(Human/Animal),54,year(s),F,"TACHYCARDIA, PALPITATIONS, PALPITATIONS, MUSCLE INJURY, HEART RATE INCREASED, HEART RATE INCREASED, FEELING ABNORMAL","Life Threatening, Patient Visited Healthcare Provider, Required Intervention"
65626,1/12/2004,,SUSPECT,GIANT EAGLE 100% APPLE JUICE FROM CONCENTRATE,20, Fruit/Fruit Prod,,,,"PYREXIA, PHARYNGITIS, NASAL CONGESTION, HEADACHE",Other Outcome
65624,1/12/2004,,SUSPECT,GIANT EAGLE 100% APPLE JUICE FROM CONCENTRATE,20, Fruit/Fruit Prod,,,,"PYREXIA, NASAL CONGESTION, HEADACHE, DIARRHOEA",Other Outcome
65617,1/12/2004,9/21/2003,SUSPECT,GOOD DAY 1% LOWFAT MILK,9, Milk/Butter/Dried Milk Prod,,,,PARAESTHESIA ORAL,Other Outcome
65625,1/12/2004,,SUSPECT,GIANT EAGLE 100% APPLE JUICE FROM CONCENTRATE,20, Fruit/Fruit Prod,,,,"PYREXIA, NASAL CONGESTION, HEADACHE, DIARRHOEA",Other Outcome
65618,1/12/2004,9/21/2003,SUSPECT,GOOD DAY 1% LOWFAT MILK,9, Milk/Butter/Dried Milk Prod,3,year(s),M,"PARAESTHESIA ORAL, PARAESTHESIA ORAL",Other Outcome
65666,1/13/2004,12/31/2003,SUSPECT,TRADER JOE'S MACADAMIA NUT POPCORN CLUSTERS,23, Nuts/Edible Seed,,,,"DIZZINESS, DIARRHOEA, DEMENTIA",Other Outcome
65670,1/13/2004,,SUSPECT,FLORA EXTRA VIRGIN OLIVE OIL,26, Vegetable Oils,,,,ABDOMINAL PAIN UPPER,Other Outcome
65660,1/13/2004,,SUSPECT,PANTENE PRO-V ESSENTIALS OVERNIGHT RENEWALS,53, Cosmetics,62,year(s),F,CAUSTIC INJURY,Other Outcome
65665,1/13/2004,12/31/2003,SUSPECT,"CRYSTAL SPRING WATER WATER,NURSERY FLUORODATED",29, Soft Drink/Water,15,month(s),M,"LOOSE STOOLS, FLATULENCE, DIARRHOEA, ABDOMINAL PAIN",Patient Visited Healthcare Provider