Report ID,CAERS Created Date,Date of Event,Product Type,Product,Product Code,Description,Patient Age,Age Units,Sex,Medra Preferred Terms,Outcomes
2018-CFS-000002,1/2/2018,5/14/2017,SUSPECT,CORAL CALCIUM,54, Vit/Min/Prot/Unconv Diet(Human/Animal),,,,"BLOOD CALCIUM INCREASED, RENAL DISORDER","Hospitalization, Patient Visited ER, "
2018-CFS-000007,1/2/2018,,SUSPECT,CELLUCOR ALPHA AMINO,54, Vit/Min/Prot/Unconv Diet(Human/Animal),15,year(s),M,"DYSPNOEA, OCULAR HYPERAEMIA, OCULAR HYPERAEMIA, GAIT DISTURBANCE","Other Seriousness, Patient Visited ER, "
2018-CFS-000008,1/2/2018,,SUSPECT,Eco Style Professional Styling Gel  Black Castor and Flax Seed Oil,53, Cosmetics,,,,PRURITUS,Other Outcome
2018-CFS-000009,1/2/2018,,SUSPECT,ECO STYLE PROFESSIONAL STYLING GEL BLACK CASTOR & FLAX SEED OIL,53, Cosmetics,,,,PRURITUS,Other Outcome
2018-CFS-000010,1/2/2018,,SUSPECT,SOY MASKING AGENTS,45, Food Additives (Human Use),36,year(s),F,"EYE IRRITATION, THROAT IRRITATION","Disability, "
2018-CFS-000018,1/2/2018,12/26/2017,SUSPECT,ECO STYLING GEL,53, Cosmetics,25,year(s),F,PRURITUS,Other Outcome
2018-CFS-000019,1/2/2018,11/23/2017,SUSPECT,RESERS MAIN ST BISTRO MASHED POTATOES,25, Vegetables/Vegetable Products,60,year(s),F,"INSOMNIA, PRURITUS, GASTROINTESTINAL DISORDER",Other Outcome
2018-CFS-000020,1/2/2018,10/27/2017,SUSPECT,KRATOM,54, Vit/Min/Prot/Unconv Diet(Human/Animal),31,year(s),M,"CONVULSION, ELECTROCARDIOGRAM ABNORMAL, DEPENDENCE, ACTIVITIES OF DAILY LIVING IMPAIRED","Hospitalization, Patient Visited Healthcare Provider, "
2018-CFS-000021,1/2/2018,12/26/2017,SUSPECT,WHIPPED SOAP LE VIE EST BELLE TYPE,53, Cosmetics,35,year(s),F,"RASH PRURITIC, HYPERSENSITIVITY",Other Outcome
2018-CFS-000022,1/2/2018,12/21/2017,SUSPECT,MARUCHAN RAMEN NOODLES,4, Macaroni/Noodle Prod,51,year(s),,"SINUS HEADACHE, MALAISE","Patient Visited Healthcare Provider, Medically Important, "
2018-CFS-000024,1/2/2018,11/1/2017,SUSPECT,ECO STYLER,53, Cosmetics,,,,"TRICHORRHEXIS, HAIR TEXTURE ABNORMAL",Other Outcome
2018-CFS-000025,1/2/2018,11/25/2017,CONCOMITANT,Magnesium,54, Vit/Min/Prot/Unconv Diet(Human/Animal),57,year(s),F,CARDIAC DISORDER,"Medically Important, "
2018-CFS-000025,1/2/2018,11/25/2017,CONCOMITANT,Vitamin D,54, Vit/Min/Prot/Unconv Diet(Human/Animal),57,year(s),F,CARDIAC DISORDER,"Medically Important, "
2018-CFS-000025,1/2/2018,11/25/2017,CONCOMITANT,Vitamin E,54, Vit/Min/Prot/Unconv Diet(Human/Animal),57,year(s),F,CARDIAC DISORDER,"Medically Important, "
2018-CFS-000025,1/2/2018,11/25/2017,SUSPECT,LIMBREL 500,41G," Medical Foods, N.E.C.",57,year(s),F,CARDIAC DISORDER,"Medically Important, "
2018-CFS-000026,1/2/2018,12/21/2017,SUSPECT,DASANI PURIFIED WATER,29, Soft Drink/Water,,,,"NIGHT SWEATS, VIRAL INFECTION, ABDOMINAL PAIN UPPER, CHILLS, HEADACHE, OROPHARYNGEAL PAIN","Hospitalization, "
2018-CFS-000027,1/2/2018,12/27/2017,SUSPECT,TERRACOTTA BRONZING POWDER,53, Cosmetics,19,year(s),F,"ERYTHEMA, SWELLING, HYPERSENSITIVITY, RASH",Other Outcome
2018-CFS-000029,1/2/2018,12/27/2017,SUSPECT,MAGNESIUM GLYCINATE,54, Vit/Min/Prot/Unconv Diet(Human/Animal),61,year(s),F,CARDIAC FAILURE,"Life Threatening, Disability, "
2018-CFS-000030,1/2/2018,12/27/2017,SUSPECT,UNCLE BEN'S READY RICE GARDEN VEGETABLE,2, Whole Grain/Milled Grain Prod/Starch,37,year(s),F,"ABDOMINAL PAIN UPPER, ABDOMINAL PAIN UPPER, ABDOMINAL DISCOMFORT, ABDOMINAL PAIN UPPER","Medically Important, "
2018-CFS-000032,1/2/2018,12/21/2017,SUSPECT,JAMBALAYA ENTREE MIX,37, Mult Food Dinner/Grav/Sauce/Special,53,year(s),M,"DIARRHOEA, NAUSEA","Other Seriousness, "
2018-CFS-000033,1/2/2018,,SUSPECT,SWANSON PROBIOTICS SACCHAROMYCES BOULARDII,54, Vit/Min/Prot/Unconv Diet(Human/Animal),,,,ADVERSE EVENT,"Medically Important, Patient Visited ER, "
2018-CFS-000035,1/2/2018,,CONCOMITANT,C-1000,54, Vit/Min/Prot/Unconv Diet(Human/Animal),85,year(s),M,"BLOOD URINE PRESENT, URINARY TRACT INFECTION","Hospitalization, "
2018-CFS-000035,1/2/2018,,CONCOMITANT,Cal Magnesium,54, Vit/Min/Prot/Unconv Diet(Human/Animal),85,year(s),M,"BLOOD URINE PRESENT, URINARY TRACT INFECTION","Hospitalization, "
2018-CFS-000035,1/2/2018,,CONCOMITANT,Vitamin D-3,54, Vit/Min/Prot/Unconv Diet(Human/Animal),85,year(s),M,"BLOOD URINE PRESENT, URINARY TRACT INFECTION","Hospitalization, "
2018-CFS-000035,1/2/2018,,SUSPECT,D-MANNOSE PURE POWDER,54, Vit/Min/Prot/Unconv Diet(Human/Animal),85,year(s),M,"BLOOD URINE PRESENT, URINARY TRACT INFECTION","Hospitalization, "
2018-CFS-000036,1/2/2018,12/30/2017,SUSPECT,GOLD DUST ADVANCED MEGA STIM PRE-WORKOUT,54, Vit/Min/Prot/Unconv Diet(Human/Animal),18,year(s),M,"AMPHETAMINES POSITIVE, NAUSEA, URINE ABNORMALITY, ABDOMINAL PAIN, COLD SWEAT, DEHYDRATION, BLOOD PRESSURE INCREASED, BLOOD URINE, HAEMATEMESIS, TACHYCARDIA, DIZZINESS","Life Threatening, Hospitalization, Patient Visited ER, "
2018-CFS-000037,1/2/2018,12/21/2017,SUSPECT,DASANI PURIFIED WATER,29, Soft Drink/Water,,,,"CHILLS, ABDOMINAL PAIN UPPER, HEADACHE, NIGHT SWEATS, OROPHARYNGEAL PAIN, VIRAL INFECTION","Hospitalization, "
2018-CFS-000039,1/3/2018,12/28/2017,SUSPECT,SLICED APPLES,20, Fruit/Fruit Prod,29,year(s),F,"FOOD POISONING, MALAISE","Medically Important, "
2018-CFS-000040,1/3/2018,12/29/2017,SUSPECT,100% VIRGIN COCONUT OIL HYDRATION MILK MASK,53, Cosmetics,25,year(s),F,"BURNING SENSATION, ERYTHEMA",Other Outcome
2018-CFS-000041,1/3/2018,12/29/2017,SUSPECT,INSTANT FULL COVER CONCEALER,53, Cosmetics,51,year(s),F,"RASH, DERMATITIS, BURNING SENSATION, ERYTHEMA, SWELLING",Other Outcome
2018-CFS-000042,1/3/2018,12/29/2017,SUSPECT,EYELASH EXTENSIONS,53, Cosmetics,,,,"EYELID PAIN, EYE IRRITATION",Other Outcome
2018-CFS-000043,1/3/2018,11/15/2017,SUSPECT,JAMIESON ACIDOPHILUS,54, Vit/Min/Prot/Unconv Diet(Human/Animal),65,year(s),M,"RASH, SKIN LESION","Other Seriousness, "
2018-CFS-000044,1/3/2018,12/29/2017,SUSPECT,5 GUM,33, Candy W/O Choc/Special/Chew Gum,,,,"ABDOMINAL DISTENSION, DIARRHOEA","Medically Important, "
2018-CFS-000046,1/3/2018,12/26/2017,SUSPECT,NYX CRYSTAL LINER,53, Cosmetics,20,year(s),F,CHEMICAL INJURY,Other Outcome
2018-CFS-000050,1/3/2018,12/5/2015,SUSPECT,KRATOM,54, Vit/Min/Prot/Unconv Diet(Human/Animal),33,year(s),M,"DEPRESSION, INSOMNIA, DRUG DEPENDENCE, ANXIETY, RESTLESSNESS, SUICIDAL IDEATION, NAUSEA, DEPENDENCE, WITHDRAWAL SYNDROME","Disability, "
2018-CFS-000052,1/3/2018,12/28/2017,SUSPECT,LAYS CLASSIC POTATO CHIPS,7, Snack Food Item,44,year(s),F,MALAISE,"Medically Important, "
2018-CFS-000054,1/3/2018,,CONCOMITANT,MVI,54, Vit/Min/Prot/Unconv Diet(Human/Animal),38,year(s),F,"CHAPPED LIPS, ERYTHEMA, PRURITUS, CHAPPED LIPS, ORAL DISCOMFORT, PAIN, CHEILITIS, HAEMORRHAGE",Other Outcome
2018-CFS-000054,1/3/2018,,SUSPECT,EOS SWEET MINT LIP BALM,53, Cosmetics,38,year(s),F,"CHAPPED LIPS, ERYTHEMA, PRURITUS, CHAPPED LIPS, ORAL DISCOMFORT, PAIN, CHEILITIS, HAEMORRHAGE",Other Outcome
2018-CFS-000061,1/3/2018,12/31/2017,SUSPECT,E.L.F. ILLUMINATING EYE CREAM,53, Cosmetics,,,,"URTICARIA, FLUSHING, BURNING SENSATION, PAIN",Other Outcome
2018-CFS-000063,1/3/2018,,SUSPECT,SUPER BETA PROSTATE,54, Vit/Min/Prot/Unconv Diet(Human/Animal),,,,MALAISE,"Hospitalization, Medically Important, "
2018-CFS-000064,1/3/2018,,SUSPECT,THYROID 180,54, Vit/Min/Prot/Unconv Diet(Human/Animal),,,,VAGINAL HAEMORRHAGE,"Other Seriousness, "
2018-CFS-000065,1/3/2018,,CONCOMITANT,multivitamins,54, Vit/Min/Prot/Unconv Diet(Human/Animal),72,year(s),F,DIVERTICULITIS,"Hospitalization, Patient Visited ER, "
2018-CFS-000065,1/3/2018,,CONCOMITANT,supplemental calcium,54, Vit/Min/Prot/Unconv Diet(Human/Animal),72,year(s),F,DIVERTICULITIS,"Hospitalization, Patient Visited ER, "
2018-CFS-000065,1/3/2018,,CONCOMITANT,vitaminC,54, Vit/Min/Prot/Unconv Diet(Human/Animal),72,year(s),F,DIVERTICULITIS,"Hospitalization, Patient Visited ER, "
2018-CFS-000065,1/3/2018,,SUSPECT,METABO379,54, Vit/Min/Prot/Unconv Diet(Human/Animal),72,year(s),F,DIVERTICULITIS,"Hospitalization, Patient Visited ER, "
2018-CFS-000066,1/3/2018,,SUSPECT,LEPTIBURN,54, Vit/Min/Prot/Unconv Diet(Human/Animal),,,,ADVERSE REACTION,"Hospitalization, "
2018-CFS-000070,1/4/2018,,SUSPECT,extra dark chocolate truffles,34, Choc/Cocoa Prod,,,,,Other Outcome
2018-CFS-000073,1/4/2018,,SUSPECT,food facility complaint,37, Mult Food Dinner/Grav/Sauce/Special,,,,,"Other Seriousness, "
2018-CFS-000075,1/4/2018,,SUSPECT,Free range chicken broth low sodium,38, Soup,,,,,Other Outcome
2018-CFS-000077,1/4/2018,11/12/2017,SUSPECT,SHAKEOLOGY CHOCOLATE,54, Vit/Min/Prot/Unconv Diet(Human/Animal),,,,"INFECTION, DIVERTICULUM, ABDOMINAL PAIN, BEDRIDDEN","Medically Important, "
2018-CFS-000079,1/4/2018,12/19/2017,SUSPECT,THYROID PERFORMANCE PLUS,54, Vit/Min/Prot/Unconv Diet(Human/Animal),70,year(s),F,"CARDIAC MURMUR, LOCAL SWELLING, WEIGHT INCREASED","Medically Important, "
2018-CFS-000080,1/4/2018,,SUSPECT,OJC PLUS BERRY GREENS,54, Vit/Min/Prot/Unconv Diet(Human/Animal),,,,"DIVERTICULITIS, GASTROINTESTINAL PAIN","Hospitalization, Medically Important, "
2018-CFS-000081,1/4/2018,12/13/2017,SUSPECT,FLINTSTONES COMPLETE,54, Vit/Min/Prot/Unconv Diet(Human/Animal),57,year(s),M,"DYSPHAGIA, CHOKING","Medically Important, "
2018-CFS-000082,1/4/2018,,SUSPECT,CITRACAL MAXIMUM,54, Vit/Min/Prot/Unconv Diet(Human/Animal),77,year(s),F,"VOMITING, VOMITING","Medically Important, "
2018-CFS-000084,1/4/2018,,SUSPECT,CITRACAL PLUS MAXIMUM,54, Vit/Min/Prot/Unconv Diet(Human/Animal),75,year(s),F,"CHOKING, DYSPHAGIA","Medically Important, "
2018-CFS-000085,1/4/2018,,SUSPECT,MAXIMUM STRENGTH MELATONIN,54, Vit/Min/Prot/Unconv Diet(Human/Animal),54,year(s),F,"TINNITUS, GLYCOSYLATED HAEMOGLOBIN INCREASED, MALAISE, BLOOD GLUCOSE INCREASED, INFLUENZA LIKE ILLNESS","Medically Important, "
2018-CFS-000087,1/4/2018,12/2/2017,CONCOMITANT,MAGNESIUM,54, Vit/Min/Prot/Unconv Diet(Human/Animal),50,year(s),F,"BLOOD PRESSURE INCREASED, MALAISE, CHRONIC OBSTRUCTIVE PULMONARY DISEASE, FATIGUE, CHEST PAIN, DYSPNOEA, ABDOMINAL PAIN, ASTHMA","Patient Visited Healthcare Provider, Medically Important, Patient Visited ER, "
2018-CFS-000087,1/4/2018,12/2/2017,SUSPECT,NATURALIST PROBIOTIC ACIDOPHILUS W/CITRUS PECTIN,54, Vit/Min/Prot/Unconv Diet(Human/Animal),50,year(s),F,"BLOOD PRESSURE INCREASED, MALAISE, CHRONIC OBSTRUCTIVE PULMONARY DISEASE, FATIGUE, CHEST PAIN, DYSPNOEA, ABDOMINAL PAIN, ASTHMA","Patient Visited Healthcare Provider, Medically Important, Patient Visited ER, "
2018-CFS-000089,1/4/2018,,SUSPECT,PURITANS PRIDE NEURO-PS,54, Vit/Min/Prot/Unconv Diet(Human/Animal),95,year(s),F,"AUTOSCOPY, AUTOSCOPY","Patient Visited Healthcare Provider, Medically Important, "
2018-CFS-000090,1/4/2018,9/5/2017,SUSPECT,EXEMPTION 4,53, Cosmetics,70,year(s),M,"EPITHELIOID MESOTHELIOMA, EXPOSURE TO CHEMICAL POLLUTION","Hospitalization, Medically Important, "
2018-CFS-000091,1/4/2018,,SUSPECT,CITRACAL MAXIMUM,54, Vit/Min/Prot/Unconv Diet(Human/Animal),,,,CHOKING,"Medically Important, "
2018-CFS-000094,1/4/2018,9/25/2017,SUSPECT,EXEMPTION 4,53, Cosmetics,70,year(s),F,"EXPOSURE TO CHEMICAL POLLUTION, DEATH, EXPOSURE TO CHEMICAL POLLUTION","Death, "
2018-CFS-000099,1/4/2018,9/8/2017,SUSPECT,EXEMPTION 4,53, Cosmetics,72,year(s),F,"EXPOSURE TO CHEMICAL POLLUTION, BIPHASIC MESOTHELIOMA, EXPOSURE TO CHEMICAL POLLUTION","Death, Hospitalization, Medically Important, "
2018-CFS-000100,1/4/2018,2/14/2014,SUSPECT,EXEMPTION 4,53, Cosmetics,41,year(s),F,"DEATH, OVARIAN CANCER STAGE III","Death, Hospitalization, "
2018-CFS-000101,1/4/2018,1/11/2017,SUSPECT,EXEMPTION 4,53, Cosmetics,37,year(s),M,"EXPOSURE TO CHEMICAL POLLUTION, EXPOSURE TO CHEMICAL POLLUTION","Medically Important, "
2018-CFS-000104,1/4/2018,12/8/2017,CONCOMITANT,EXEMPTION 4,,,39,year(s),F,"EYELID IRRITATION, EYE PAIN, DRY EYE, CHEMICAL INJURY, EYE IRRITATION, EYELID OEDEMA","Patient Visited Healthcare Provider, "
2018-CFS-000104,1/4/2018,12/8/2017,SUSPECT,EXEMPTION 4,53, Cosmetics,39,year(s),F,"EYELID IRRITATION, EYE PAIN, DRY EYE, CHEMICAL INJURY, EYE IRRITATION, EYELID OEDEMA","Patient Visited Healthcare Provider, "
2018-CFS-000109,1/5/2018,11/16/2017,CONCOMITANT,MULTIVITAMIN,54, Vit/Min/Prot/Unconv Diet(Human/Animal),42,year(s),F,"HYPERSENSITIVITY, ODYNOPHAGIA, SWELLING FACE, LIP SWELLING, THROAT TIGHTNESS, ORAL PRURITUS, DYSPHAGIA","Medically Important, "
2018-CFS-000109,1/5/2018,11/16/2017,SUSPECT,IRON,54, Vit/Min/Prot/Unconv Diet(Human/Animal),42,year(s),F,"HYPERSENSITIVITY, ODYNOPHAGIA, SWELLING FACE, LIP SWELLING, THROAT TIGHTNESS, ORAL PRURITUS, DYSPHAGIA","Medically Important, "
2018-CFS-000110,1/5/2018,,SUSPECT,SUBLINGUAL LIQUID B COMPLEX,54, Vit/Min/Prot/Unconv Diet(Human/Animal),,,,"LIP SWELLING, CONVULSION, DYSPNOEA, LOSS OF CONSCIOUSNESS, PUPILLARY REFLEX IMPAIRED, RUBBER SENSITIVITY","Patient Visited Healthcare Provider, Medically Important, "
2018-CFS-000111,1/5/2018,11/17/2017,SUSPECT,C-1000MG WITH BIOFLAVONOIDS AND WILD ROSE HIPS,54, Vit/Min/Prot/Unconv Diet(Human/Animal),67,year(s),M,"HYPOAESTHESIA, BLOOD TEST ABNORMAL, ATROPHY, GAIT DISTURBANCE","Medically Important, "
2018-CFS-000111,1/5/2018,11/17/2017,SUSPECT,CO Q-10,54, Vit/Min/Prot/Unconv Diet(Human/Animal),67,year(s),M,"HYPOAESTHESIA, BLOOD TEST ABNORMAL, ATROPHY, GAIT DISTURBANCE","Medically Important, "
2018-CFS-000111,1/5/2018,11/17/2017,SUSPECT,FORSKOLIN,54, Vit/Min/Prot/Unconv Diet(Human/Animal),67,year(s),M,"HYPOAESTHESIA, BLOOD TEST ABNORMAL, ATROPHY, GAIT DISTURBANCE","Medically Important, "
2018-CFS-000111,1/5/2018,11/17/2017,SUSPECT,NAC N-ACETYL CYSTEINE,54, Vit/Min/Prot/Unconv Diet(Human/Animal),67,year(s),M,"HYPOAESTHESIA, BLOOD TEST ABNORMAL, ATROPHY, GAIT DISTURBANCE","Medically Important, "
2018-CFS-000111,1/5/2018,11/17/2017,SUSPECT,NIACINAMIDE,54, Vit/Min/Prot/Unconv Diet(Human/Animal),67,year(s),M,"HYPOAESTHESIA, BLOOD TEST ABNORMAL, ATROPHY, GAIT DISTURBANCE","Medically Important, "
2018-CFS-000111,1/5/2018,11/17/2017,SUSPECT,PYCNOGENOL,54, Vit/Min/Prot/Unconv Diet(Human/Animal),67,year(s),M,"HYPOAESTHESIA, BLOOD TEST ABNORMAL, ATROPHY, GAIT DISTURBANCE","Medically Important, "
2018-CFS-000112,1/5/2018,,CONCOMITANT,Vitamin D3,54, Vit/Min/Prot/Unconv Diet(Human/Animal),80,year(s),M,"ASTHENIA, ANXIETY, ARRHYTHMIA, PALPITATIONS, HEADACHE, FATIGUE","Medically Important, Patient Visited ER, "
2018-CFS-000112,1/5/2018,,SUSPECT,C-500MG WITH WILD ROSE HIPS,54, Vit/Min/Prot/Unconv Diet(Human/Animal),80,year(s),M,"ASTHENIA, ANXIETY, ARRHYTHMIA, PALPITATIONS, HEADACHE, FATIGUE","Medically Important, Patient Visited ER, "
2018-CFS-000113,1/5/2018,,CONCOMITANT,One a Day Multivitamin,54, Vit/Min/Prot/Unconv Diet(Human/Animal),70,year(s),F,"DRY EYE, BLOOD PRESSURE INCREASED, ABDOMINAL DISCOMFORT","Medically Important, "
2018-CFS-000113,1/5/2018,,SUSPECT,"HAIR, SKIN & NAILS BIOTIN",54, Vit/Min/Prot/Unconv Diet(Human/Animal),70,year(s),F,"DRY EYE, BLOOD PRESSURE INCREASED, ABDOMINAL DISCOMFORT","Medically Important, "
2018-CFS-000114,1/5/2018,11/30/2017,SUSPECT,GLUCOSAMINE CHONDROITIN MSM,54, Vit/Min/Prot/Unconv Diet(Human/Animal),71,year(s),M,"CHOKING, VOMITING","Life Threatening, Medically Important, "
2018-CFS-000115,1/5/2018,11/23/2017,SUSPECT,E-400 IU RAPID RELEASE SOFTGELS,54, Vit/Min/Prot/Unconv Diet(Human/Animal),66,year(s),M,"LIP SWELLING, ANAPHYLACTIC REACTION, THROAT TIGHTNESS, TONGUE OEDEMA, CHEST DISCOMFORT, COUGH, WHEEZING","Medically Important, "
2018-CFS-000116,1/5/2018,12/2/2017,CONCOMITANT,Digestive Enzyme,54, Vit/Min/Prot/Unconv Diet(Human/Animal),65,year(s),F,THROAT TIGHTNESS,"Medically Important, "
2018-CFS-000116,1/5/2018,12/2/2017,CONCOMITANT,Yeast Rice,54, Vit/Min/Prot/Unconv Diet(Human/Animal),65,year(s),F,THROAT TIGHTNESS,"Medically Important, "
2018-CFS-000116,1/5/2018,12/2/2017,SUSPECT,VITAMIN D3,54, Vit/Min/Prot/Unconv Diet(Human/Animal),65,year(s),F,THROAT TIGHTNESS,"Medically Important, "
2018-CFS-000117,1/5/2018,,SUSPECT,PROBIOTIC 2 BILLION LIVE CULTURES,54, Vit/Min/Prot/Unconv Diet(Human/Animal),69,year(s),F,"DIARRHOEA, NAUSEA, HEADACHE, MUSCLE SPASMS, PRURITUS GENERALISED, MALAISE, TREMOR, TONIC CLONIC MOVEMENTS, VOMITING, HYPERHIDROSIS","Patient Visited Healthcare Provider, Medically Important, "
2018-CFS-000118,1/5/2018,12/8/2017,SUSPECT,OPTIMIZED NAD + CELL REGENERATOR,54, Vit/Min/Prot/Unconv Diet(Human/Animal),57,year(s),M,"INSOMNIA, BLOOD PRESSURE INCREASED","Hospitalization, "
2018-CFS-000121,1/5/2018,5/3/2017,SUSPECT,ARBONNE ESSENTIALS 7-DAY BODY CLEANSE,54, Vit/Min/Prot/Unconv Diet(Human/Animal),57,year(s),F,"URTICARIA, HYPERSENSITIVITY, DYSPHAGIA, DYSPNOEA, SWELLING","Medically Important, Patient Visited ER, "
2018-CFS-000122,1/5/2018,10/30/2017,SUSPECT,DIGESTIVE FREEDOM PLUS,54, Vit/Min/Prot/Unconv Diet(Human/Animal),69,year(s),F,"PAIN, ABDOMINAL PAIN","Medically Important, Patient Visited ER, "
2018-CFS-000124,1/5/2018,12/28/2017,SUSPECT,VITAMIN D3,54, Vit/Min/Prot/Unconv Diet(Human/Animal),61,year(s),F,"SINUS TACHYCARDIA, SINUS CONGESTION, FEBRILE NEUTROPENIA, DECREASED APPETITE, INFLUENZA, PYREXIA","Hospitalization, Patient Visited Healthcare Provider, "
2018-CFS-000130,1/6/2018,,SUSPECT,Whole Milk,9, Milk/Butter/Dried Milk Prod,,,,,"Patient Visited Healthcare Provider, Patient Visited ER, "
2018-CFS-000131,1/6/2018,,SUSPECT,Three Berry Blend (Frozen),21, Fruit/Fruit Prod,,,,,Other Outcome
2018-CFS-000135,1/6/2018,,SUSPECT,Omega-3 fish oil gummies,54, Vit/Min/Prot/Unconv Diet(Human/Animal),,,,PYREXIA,Other Outcome
2018-CFS-000137,1/6/2018,,SUSPECT,Chunk Light Tuna in Oil,16, Fishery/Seafood Prod,,,,,Other Outcome
2018-CFS-000140,1/7/2018,1/3/2018,SUSPECT,TRUCONTROL,54, Vit/Min/Prot/Unconv Diet(Human/Animal),59,year(s),F,"RHEUMATOID ARTHRITIS, HEART RATE IRREGULAR","Medically Important, Other Seriousness, "
2018-CFS-000140,1/7/2018,1/3/2018,SUSPECT,TRUFIX,54, Vit/Min/Prot/Unconv Diet(Human/Animal),59,year(s),F,"RHEUMATOID ARTHRITIS, HEART RATE IRREGULAR","Medically Important, Other Seriousness, "
2018-CFS-000141,1/7/2018,,SUSPECT,Hearts of Romaine,24, Vegetables/Vegetable Products,,,,,Other Outcome
2018-CFS-000146,1/8/2018,8/30/2017,SUSPECT,EXEMPTION 4,53, Cosmetics,92,year(s),F,"EXPOSURE TO CHEMICAL POLLUTION, DEATH, EXPOSURE TO CHEMICAL POLLUTION","Death, Hospitalization, "
2018-CFS-000148,1/8/2018,6/16/2017,SUSPECT,EXEMPTION 4,53, Cosmetics,83,year(s),F,"EXPOSURE TO CHEMICAL POLLUTION, EXPOSURE TO CHEMICAL POLLUTION, ENDOMETRIAL CANCER STAGE I","Medically Important, "
2018-CFS-000149,1/8/2018,,SUSPECT,EXEMPTION 4,53, Cosmetics,,,,OVARIAN CANCER,"Medically Important, "
2018-CFS-000153,1/8/2018,11/28/2014,SUSPECT,EXEMPTION 4,53, Cosmetics,58,year(s),F,OVARIAN CANCER STAGE III,"Hospitalization, Medically Important, "
2018-CFS-000156,1/8/2018,12/24/2017,SUSPECT,MARKET PANTRY CHICKEN NUGGETS,17," Meat, Meat Products and Poultry",2,year(s),,VOMITING,"Other Seriousness, "
2018-CFS-000157,1/8/2018,11/21/2017,SUSPECT,ORGANIC APPLES,20, Fruit/Fruit Prod,,,,LIP SWELLING,"Disability, "
2018-CFS-000157,1/8/2018,11/21/2017,SUSPECT,ORGANIC PEARS,20, Fruit/Fruit Prod,,,,LIP SWELLING,"Disability, "
2018-CFS-000158,1/8/2018,,SUSPECT,CITRACAL,54, Vit/Min/Prot/Unconv Diet(Human/Animal),78,year(s),M,"FOREIGN BODY, OESOPHAGEAL IRRITATION, DYSPNOEA, FOREIGN BODY",Other Outcome
2018-CFS-000159,1/8/2018,,SUSPECT,NATURE MADE MAGNESIUM CITRATE,54, Vit/Min/Prot/Unconv Diet(Human/Animal),90,year(s),M,"FOREIGN BODY, CYANOSIS, DYSPNOEA, CHOKING, RETCHING","Medically Important, "
2018-CFS-000160,1/8/2018,,CONCOMITANT,CENTRUM,54, Vit/Min/Prot/Unconv Diet(Human/Animal),96,year(s),F,INTERNATIONAL NORMALISED RATIO INCREASED,"Medically Important, "
2018-CFS-000160,1/8/2018,,CONCOMITANT,VITAMIN D,54, Vit/Min/Prot/Unconv Diet(Human/Animal),96,year(s),F,INTERNATIONAL NORMALISED RATIO INCREASED,"Medically Important, "
2018-CFS-000160,1/8/2018,,SUSPECT,PRESERVISION AREDS 2,54, Vit/Min/Prot/Unconv Diet(Human/Animal),96,year(s),F,INTERNATIONAL NORMALISED RATIO INCREASED,"Medically Important, "
2018-CFS-000161,1/8/2018,,SUSPECT,OCUVITE ADULT 50+,54, Vit/Min/Prot/Unconv Diet(Human/Animal),87,year(s),M,"DYSPHAGIA, FOREIGN BODY","Medically Important, "
2018-CFS-000162,1/8/2018,,SUSPECT,CENTRUM SILVER,54, Vit/Min/Prot/Unconv Diet(Human/Animal),,,,DIABETES MELLITUS,"Medically Important, "
2018-CFS-000166,1/8/2018,,SUSPECT,CENTRUM SILVER,54, Vit/Min/Prot/Unconv Diet(Human/Animal),56,year(s),M,HAEMATOCHEZIA,"Medically Important, "
2018-CFS-000172,1/8/2018,12/20/2017,SUSPECT,SIMPLYONE 50+ WOMEN�S MULTIVITAMIN,54, Vit/Min/Prot/Unconv Diet(Human/Animal),63,year(s),F,"ROAD TRAFFIC ACCIDENT, LOSS OF CONSCIOUSNESS, CONTUSION, CONCUSSION, VERTIGO, BURNING SENSATION, LIMB INJURY, MALAISE, FEELING HOT, CHEMICAL INJURY, FLUSHING","Life Threatening, Patient Visited ER, "
2018-CFS-000173,1/9/2018,,CONCOMITANT,Plexus Slim,54, Vit/Min/Prot/Unconv Diet(Human/Animal),,,,"NAUSEA, LIP SWELLING, SWOLLEN TONGUE, VOMITING, SWELLING FACE","Hospitalization, "
2018-CFS-000173,1/9/2018,,CONCOMITANT,Plexus Slim 2.0,54, Vit/Min/Prot/Unconv Diet(Human/Animal),,,,"NAUSEA, LIP SWELLING, SWOLLEN TONGUE, VOMITING, SWELLING FACE","Hospitalization, "
2018-CFS-000173,1/9/2018,,SUSPECT,PLEXUS SLIM,54, Vit/Min/Prot/Unconv Diet(Human/Animal),,,,"NAUSEA, LIP SWELLING, SWOLLEN TONGUE, VOMITING, SWELLING FACE","Hospitalization, "
2018-CFS-000173,1/9/2018,,SUSPECT,PLEXUS SLIM 2.0,54, Vit/Min/Prot/Unconv Diet(Human/Animal),,,,"NAUSEA, LIP SWELLING, SWOLLEN TONGUE, VOMITING, SWELLING FACE","Hospitalization, "
2018-CFS-000175,1/9/2018,,SUSPECT,PRESERVISION AREDS 2,54, Vit/Min/Prot/Unconv Diet(Human/Animal),98,year(s),M,"MACULAR DEGENERATION, DYSPHAGIA, CHOKING","Medically Important, "
2018-CFS-000176,1/9/2018,11/9/2017,CONCOMITANT,Dr. Axe Bone Broth Protein,54, Vit/Min/Prot/Unconv Diet(Human/Animal),,,,"STRESS, BLOOD PRESSURE INCREASED, ANXIETY","Hospitalization, Patient Visited ER, "
2018-CFS-000176,1/9/2018,11/9/2017,SUSPECT,BERBERINE AND MICROPQQ ADVANCED,54, Vit/Min/Prot/Unconv Diet(Human/Animal),,,,"STRESS, BLOOD PRESSURE INCREASED, ANXIETY","Hospitalization, Patient Visited ER, "
2018-CFS-000178,1/9/2018,11/26/2017,SUSPECT,NUGENIX,54, Vit/Min/Prot/Unconv Diet(Human/Animal),51,year(s),M,PULMONARY EMBOLISM,"Life Threatening, "
2018-CFS-000179,1/9/2018,12/21/2017,SUSPECT,JAMBALAYA ENTREE MIX,37, Mult Food Dinner/Grav/Sauce/Special,,,,"NAUSEA, NAUSEA","Other Seriousness, "
2018-CFS-000180,1/9/2018,12/21/2017,SUSPECT,JAMBALAYA ENTREE MIX,37, Mult Food Dinner/Grav/Sauce/Special,,,,"DIARRHOEA, NAUSEA",Other Outcome
2018-CFS-000182,1/9/2018,12/21/2017,SUSPECT,EXEMPTION 4,16, Fishery/Seafood Prod,,,,"LISTERIOSIS, GASTROINTESTINAL DISORDER",Other Outcome
2018-CFS-000183,1/9/2018,12/11/2017,CONCOMITANT,CALCIUM,54, Vit/Min/Prot/Unconv Diet(Human/Animal),62,year(s),M,"DYSPNOEA, WEIGHT INCREASED, BLOOD PRESSURE INCREASED","Patient Visited Healthcare Provider, Medically Important, Patient Visited ER, "
2018-CFS-000183,1/9/2018,12/11/2017,CONCOMITANT,KRILL OIL,54, Vit/Min/Prot/Unconv Diet(Human/Animal),62,year(s),M,"DYSPNOEA, WEIGHT INCREASED, BLOOD PRESSURE INCREASED","Patient Visited Healthcare Provider, Medically Important, Patient Visited ER, "
2018-CFS-000183,1/9/2018,12/11/2017,CONCOMITANT,VITAMIN B12,54, Vit/Min/Prot/Unconv Diet(Human/Animal),62,year(s),M,"DYSPNOEA, WEIGHT INCREASED, BLOOD PRESSURE INCREASED","Patient Visited Healthcare Provider, Medically Important, Patient Visited ER, "
2018-CFS-000183,1/9/2018,12/11/2017,CONCOMITANT,VITAMIN C,54, Vit/Min/Prot/Unconv Diet(Human/Animal),62,year(s),M,"DYSPNOEA, WEIGHT INCREASED, BLOOD PRESSURE INCREASED","Patient Visited Healthcare Provider, Medically Important, Patient Visited ER, "
2018-CFS-000183,1/9/2018,12/11/2017,CONCOMITANT,VITAMIN D3,54, Vit/Min/Prot/Unconv Diet(Human/Animal),62,year(s),M,"DYSPNOEA, WEIGHT INCREASED, BLOOD PRESSURE INCREASED","Patient Visited Healthcare Provider, Medically Important, Patient Visited ER, "