﻿Report ID,CAERS Created Date,Date of Event,Product Type,Product,Product Code,Description,Patient Age,Age Units,Sex,MedDRA Preferred Terms,Outcomes
172934,1/1/2014,12/5/2013,SUSPECT,VALUED NATIONAL PINE NUTS,23, Nuts/Edible Seed,,,F,"DYSGEUSIA, HYPERSENSITIVITY",Other Outcome
172937,1/1/2014,,SUSPECT,"DAVID'S SUNFLOWER SEEDS, RANCH FLAVORED",23, Nuts/Edible Seed,,,F,"PAIN, TENDERNESS, BURNING SENSATION, CAUSTIC INJURY, MUCOSAL ULCERATION","Hospitalization, Patient Visited Healthcare Provider"
172939,1/1/2014,1/15/2013,SUSPECT,"KASHI WHOLE WHEAT BISCUITS, ISLAND VANILLA",5, Cereal Prep/Breakfast Food,,,M,"GASTROINTESTINAL DISORDER, ABDOMINAL PAIN, FLUSHING, FEELING HOT, BODY TEMPERATURE INCREASED, DYSPEPSIA, FEELING OF BODY TEMPERATURE CHANGE, MALAISE, VOMITING",Other Outcome
172940,1/1/2014,,SUSPECT,DANNON DANNON LITE & FIT GREEK YOGURT CHERRY,9, Milk/Butter/Dried Milk Prod,,,M,NAUSEA,Other Outcome
172941,1/1/2014,12/16/2013,SUSPECT,COPPER RIVER KIPPERED ALASKA SILVER SALMON,16, Fishery/Seafood Prod,,,M,LACERATION,Other Outcome
172944,1/1/2014,1/23/2013,SUSPECT,"WELCH'S 100% GRAPE JUICE, FROM CONCENTRATE WITH ADDED VITAMIN C",20, Fruit/Fruit Prod,,,M,"SLEEP DISORDER, SALIVARY GLAND DISORDER, ANXIETY",Other Outcome
172945,1/1/2014,,SUSPECT,SAVORITZ ORIGINAL BUTTERY ROUND CRACKERS,3, Bakery Prod/Dough/Mix/Icing,,,M,VOMITING,Other Outcome
172947,1/2/2014,,SUSPECT,CITRACAL MAXIMUM (CHOLECALCIFEROL + CALCLIUM CITRATE) FILM-COATED TABLET,54, Vit/Min/Prot/Unconv Diet(Human/Animal),64,year(s),F,"FOREIGN BODY TRAUMA, CHOKING",Medically Important
172947,1/2/2014,,CONCOMITANT,VITAMIN C (ASCORBIC ACID),54, Vit/Min/Prot/Unconv Diet(Human/Animal),64,year(s),F,"FOREIGN BODY TRAUMA, CHOKING",Medically Important
172947,1/2/2014,,CONCOMITANT,FISH OIL (FISH OIL),54, Vit/Min/Prot/Unconv Diet(Human/Animal),64,year(s),F,"FOREIGN BODY TRAUMA, CHOKING",Medically Important
172948,1/2/2014,12/4/2013,SUSPECT,"CENTRUM SILVER WOMEN'S 50+ (MULTIMINERALS, MULTIVITAMINS) TABLET",54, Vit/Min/Prot/Unconv Diet(Human/Animal),,,F,"FEELING ABNORMAL, CHEST DISCOMFORT, CHOKING, VOMITING",Medically Important
172949,1/2/2014,,SUSPECT,"CENTRUM SILVER (MULTIMINERALS, MULTIVITAMINS)",54, Vit/Min/Prot/Unconv Diet(Human/Animal),69,year(s),F,"DYSPNOEA, DIZZINESS, ABDOMINAL PAIN, HEADACHE, VULVOVAGINAL DISCOMFORT, DYSURIA, COLITIS, VULVOVAGINAL BURNING SENSATION, MUSCULAR WEAKNESS","Patient Visited Healthcare Provider, Medically Important"
172950,1/2/2014,,SUSPECT,"CENTRUM ULTRA WOMEN'S (MULTIMINERALS, MULTIVITAMINS) TABLET",54, Vit/Min/Prot/Unconv Diet(Human/Animal),,,F,"CHOKING, THROAT IRRITATION",Medically Important
172951,1/2/2014,,SUSPECT,"CENTRUM SILVER WOMEN'S 50+ (MULTIMINERALS, MULTIVITAMINS) TABLET",54, Vit/Min/Prot/Unconv Diet(Human/Animal),,,F,"CHOKING, DYSPHAGIA",Medically Important
172952,1/2/2014,11/27/2013,SUSPECT,"CENTRUM SILVER WOMEN'S 50+ (MULTIMINERALS, MULTIVITAMINS) TABLET",54, Vit/Min/Prot/Unconv Diet(Human/Animal),62,year(s),F,"ANXIETY, DYSPHAGIA, CHOKING, CHOKING SENSATION, FOREIGN BODY TRAUMA",Medically Important
172953,1/2/2014,,SUSPECT,"CENTRUM SILVER WOMEN'S 50+ (MULTIMINERALS, MULTIVITAMINS)TABLET",54, Vit/Min/Prot/Unconv Diet(Human/Animal),70,year(s),F,CHOKING,Medically Important
172954,1/2/2014,,SUSPECT,"CENTRUM SILVER WOMEN'S 50+ (MULTIMINERALS, MULTIVITAMINS) TABLET",54, Vit/Min/Prot/Unconv Diet(Human/Animal),70,year(s),F,"PAIN, DYSPHAGIA, CHOKING, OROPHARYNGEAL PAIN, FOREIGN BODY TRAUMA",Medically Important
172955,1/2/2014,,SUSPECT,"CENTRUM SILVER WOMEN'S 50+ (MULTIMINERALS, MULTIVITAMINS) TABLET",54, Vit/Min/Prot/Unconv Diet(Human/Animal),,,F,"FEAR, CHOKING, DYSPHAGIA",Medically Important
172956,1/2/2014,,SUSPECT,"CENTRUM SILVER MEN'S 50+ (MULTIMINERALS, MULTIVITAMINS) TABLET",54, Vit/Min/Prot/Unconv Diet(Human/Animal),,,M,HAEMATOLOGICAL MALIGNANCY,Medically Important
172958,1/2/2014,,SUSPECT,"CENTRUM SILVER WOMEN'S 50+ (MULTIMINERALS, MULTIVITAMINS) TABLET",54, Vit/Min/Prot/Unconv Diet(Human/Animal),71,year(s),,CHOKING,Medically Important
172959,1/2/2014,10/31/2013,SUSPECT,PROTANDIM,54, Vit/Min/Prot/Unconv Diet(Human/Animal),73,year(s),F,"NAUSEA, ABDOMINAL DISTENSION, ABDOMINAL PAIN, FLATULENCE, CONSTIPATION",Hospitalization
172960,1/2/2014,,SUSPECT,NUTRILITE GLUCOSAMINE-7,54, Vit/Min/Prot/Unconv Diet(Human/Animal),,,F,"DISCOMFORT, INFECTION, ABDOMINAL PAIN UPPER",Hospitalization
172961,1/2/2014,11/29/2013,SUSPECT,"ONE A DAY MEN'S HEALTH FORMULA (MULTIVITAMINS, MULTIMINERALS) FILM-COATED TABLET",54, Vit/Min/Prot/Unconv Diet(Human/Animal),45,year(s),M,"CHOKING, DYSPNOEA, FOREIGN BODY TRAUMA",Medically Important
172962,1/2/2014,,SUSPECT,NUTRILITE WOMENS PACK BALANCED HEALTH OMEGA-3 SUPPLEMENT,54, Vit/Min/Prot/Unconv Diet(Human/Animal),,,F,"HAEMORRHAGE, GENITAL HAEMORRHAGE",Hospitalization
172963,1/2/2014,10/31/2013,SUSPECT,"PREVAGEN, 10MG",54, Vit/Min/Prot/Unconv Diet(Human/Animal),85,year(s),F,"COLITIS, VOMITING, FLATULENCE, DIVERTICULITIS, NAUSEA",Hospitalization
172964,1/2/2014,10/19/2013,SUSPECT,BOTANIC CHOICE THYROID COMPLEX CAPSULE,54, Vit/Min/Prot/Unconv Diet(Human/Animal),,,F,"ANXIETY, DIZZINESS, DEPRESSED MOOD, TREMOR",Hospitalization
172964,1/2/2014,10/19/2013,SUSPECT,BOTANIC CHOICE ADVANCED MEMORY COMPLEX,54, Vit/Min/Prot/Unconv Diet(Human/Animal),,,F,"ANXIETY, DIZZINESS, DEPRESSED MOOD, TREMOR",Hospitalization
172965,1/2/2014,11/22/2013,SUSPECT,"CENTRUM SILVER ADULTS 50+ (MULTIMINERALS, MULTIVITAMINS) TABLET",54, Vit/Min/Prot/Unconv Diet(Human/Animal),66,year(s),F,"RASH, HYPERSENSITIVITY",Medically Important
172966,1/2/2014,,SUSPECT,"CENTRUM SILVER WOMENS 50+ (MULTIMINERALS, MULTIVITAMINS) TABLET",54, Vit/Min/Prot/Unconv Diet(Human/Animal),93,year(s),F,"DYSPHAGIA, CHOKING",Medically Important
172967,1/3/2014,10/18/2013,SUSPECT,ORGANIC VANILLA SOY MILK,9, Milk/Butter/Dried Milk Prod,4,year(s),,"ABDOMINAL DISCOMFORT, VOMITING","Disability, Patient Visited Healthcare Provider"
172967,1/3/2014,10/18/2013,SUSPECT,ORGANIC CHOCOLATE SOY MILK,9, Milk/Butter/Dried Milk Prod,4,year(s),,"ABDOMINAL DISCOMFORT, VOMITING","Disability, Patient Visited Healthcare Provider"
172968,1/3/2014,,SUSPECT,RUSSET POTATO,25, Vegetables/Vegetable Products,,,M,"SALMONELLOSIS, MALAISE","Hospitalization, Patient Visited Healthcare Provider"
172969,1/3/2014,10/18/2013,SUSPECT,NATURE'S PROMISE ORGANIC VANILLA SOY MILK,9, Milk/Butter/Dried Milk Prod,,,,"ABDOMINAL DISCOMFORT, VOMITING","Disability, Patient Visited Healthcare Provider"
172969,1/3/2014,10/18/2013,SUSPECT,NATURE'S PROMISE ORGANIC CHOCOLATE SOY MILK,9, Milk/Butter/Dried Milk Prod,,,,"ABDOMINAL DISCOMFORT, VOMITING","Disability, Patient Visited Healthcare Provider"
172970,1/3/2014,,SUSPECT,"CENTRUM SILVER WOMEN'S 50+ (MULTIMINERALS, MULTIVITAMINS) TABLET",54, Vit/Min/Prot/Unconv Diet(Human/Animal),82,year(s),F,"BODY HEIGHT DECREASED, FEAR, CHOKING",Medically Important
172971,1/3/2014,12/20/2013,SUSPECT,POPCORN INDIANA DRIZZLE BLACK & WHITE KETTLE CORN,7, Snack Food Item,,,M,"TOOTH DISORDER, TOOTH INJURY",Other Outcome
172972,1/3/2014,5/14/2013,SUSPECT,RED DIAMOND SWEET TEA,31, Coffee/Tea,,,M,"ABDOMINAL PAIN, DIARRHOEA, ABDOMINAL PAIN UPPER",Other Outcome
172973,1/3/2014,12/20/2013,SUSPECT,REESE GOLDEN SMOKED FILET OF TROUT,16, Fishery/Seafood Prod,,,M,"DYSPEPSIA, NAUSEA",Other Outcome
172975,1/4/2014,10/16/2013,SUSPECT,SHRED MATRIX 8 STAGE WEIGHT LOSS SYSTEM,54, Vit/Min/Prot/Unconv Diet(Human/Animal),,,M,"PALPITATIONS, HYPERSENSITIVITY, CARDIAC FIBRILLATION, HEART RATE ABNORMAL","Life Threatening, Patient Visited Healthcare Provider, Patient Visited ER"
172978,1/6/2014,6/26/2013,SUSPECT,SWISS PREMIUM ICED TEA,31, Coffee/Tea,,,M,DIARRHOEA,Other Outcome
172979,1/6/2014,12/23/2013,SUSPECT,"ACCERA, INC. AXONA",41, Dietary Conventional Foods/Meal Replacements,78,year(s),F,"NAUSEA, LIPASE INCREASED, ABDOMINAL PAIN, VOMITING, BLOOD AMYLASE INCREASED, PANCREATITIS",Hospitalization
172980,1/6/2014,,SUSPECT,ASSAULT,54, Vit/Min/Prot/Unconv Diet(Human/Animal),21,year(s),M,"PHARYNGEAL OEDEMA, FACE OEDEMA, RASH, SWELLING, DYSPNOEA, DIZZINESS, HYPERSENSITIVITY, PARAESTHESIA","Medically Important, Patient Visited ER"
172980,1/6/2014,,CONCOMITANT,FISH OIL,54, Vit/Min/Prot/Unconv Diet(Human/Animal),21,year(s),M,"PHARYNGEAL OEDEMA, FACE OEDEMA, RASH, SWELLING, DYSPNOEA, DIZZINESS, HYPERSENSITIVITY, PARAESTHESIA","Medically Important, Patient Visited ER"
172980,1/6/2014,,CONCOMITANT,AMINO ACIDS,54, Vit/Min/Prot/Unconv Diet(Human/Animal),21,year(s),M,"PHARYNGEAL OEDEMA, FACE OEDEMA, RASH, SWELLING, DYSPNOEA, DIZZINESS, HYPERSENSITIVITY, PARAESTHESIA","Medically Important, Patient Visited ER"
172981,1/6/2014,12/26/2013,SUSPECT,KIRKLAND FAST ACTING LACTASE,54, Vit/Min/Prot/Unconv Diet(Human/Animal),53,year(s),F,"ABDOMINAL PAIN UPPER, DIARRHOEA, VOMITING",Other Outcome
172982,1/6/2014,12/26/2013,SUSPECT,RAW PEPITAS,23, Nuts/Edible Seed,63,year(s),F,"VOMITING, DIZZINESS, CHILLS, HYPERHIDROSIS, HYPERSENSITIVITY",Medically Important
172983,1/6/2014,11/17/2013,SUSPECT,TERRY NATURALLY CURAMIN,54, Vit/Min/Prot/Unconv Diet(Human/Animal),70,year(s),F,"BLOOD CHLORIDE DECREASED, PHARYNGITIS, MUSCLE STRAIN, BLOOD CREATININE INCREASED, BLOOD UREA INCREASED, HEART RATE INCREASED, MALAISE, DIARRHOEA, PAIN, BLOOD PRESSURE INCREASED",Medically Important
172986,1/6/2014,7/4/2013,SUSPECT,BASA SWAI FISH,16, Fishery/Seafood Prod,,,F,"DYSPHAGIA, FOOD POISONING, SWELLING, PRURITUS","Life Threatening, Hospitalization, Patient Visited Healthcare Provider, Patient Visited ER"
172987,1/6/2014,12/16/2013,SUSPECT,LACTATION VITAMIN BLEND MOTHER'S MILK PLUS,54, Vit/Min/Prot/Unconv Diet(Human/Animal),40,year(s),F,"HYPERSENSITIVITY, URTICARIA",Other Outcome
172988,1/6/2014,1/1/2014,SUSPECT,ALDI OATMEAL,5, Cereal Prep/Breakfast Food,,,,"RASH, SWELLING FACE, WHEEZING, BURNING SENSATION, ANAPHYLACTIC REACTION, PRURITUS GENERALISED, COUGH",Patient Visited ER
172989,1/7/2014,9/29/2013,SUSPECT,RESER'S STONEMILL KITCHENS COUNTRY RED POTATO SALAD,39, Prep Salad Prod,2,year(s),,"CONVULSION, VOMITING, INFLAMMATION, INFECTION, NAUSEA, ABDOMINAL PAIN UPPER, BODY TEMPERATURE INCREASED",Patient Visited Healthcare Provider
172990,1/7/2014,9/29/2013,SUSPECT,RESER'S STONEMILL KITCHENS COUNTRY RED POTATO SALAD,39, Prep Salad Prod,,,,"ABDOMINAL PAIN UPPER, FATIGUE, NAUSEA",Other Outcome
172991,1/7/2014,9/29/2013,SUSPECT,RESER'S STONEMILL KITCHENS COUNTRY RED POTATO SALAD,39, Prep Salad Prod,,,,"FATIGUE, NAUSEA, ABDOMINAL PAIN UPPER",Other Outcome
172992,1/7/2014,9/29/2013,SUSPECT,RESER'S STONEMILL KITCHENS COUNTRY RED POTATO SALAD,39, Prep Salad Prod,,,,"ABDOMINAL PAIN UPPER, NAUSEA, FATIGUE",Other Outcome
172993,1/7/2014,9/29/2013,SUSPECT,RESER'S STONEMILL KITCHENS COUNTRY RED POTATO SALAD,39, Prep Salad Prod,,,,"ABDOMINAL PAIN UPPER, FATIGUE, NAUSEA",Other Outcome
172994,1/7/2014,9/29/2013,SUSPECT,RESER'S STONEMILL KITCHENS COUNTRY RED POTATO SALAD,39, Prep Salad Prod,,,,"ABDOMINAL PAIN UPPER, NAUSEA, FATIGUE",Other Outcome
172995,1/7/2014,9/29/2013,SUSPECT,RESER'S STONEMILL KITCHENS COUNTRY RED POTATO SALAD,39, Prep Salad Prod,,,,"ABDOMINAL PAIN UPPER, NAUSEA, FATIGUE",Other Outcome
172996,1/7/2014,9/29/2013,SUSPECT,RESER'S STONEMILL KITCHENS COUNTRY RED POTATO SALAD,39, Prep Salad Prod,,,,"ABDOMINAL PAIN UPPER, FATIGUE, NAUSEA",Other Outcome
172998,1/7/2014,,SUSPECT,"CENTRUM SILVER WOMEN'S 50+ (MULTIMINERALS, MULTIVITAMINS) TABLET",54, Vit/Min/Prot/Unconv Diet(Human/Animal),6,Decade(s),F,"FALL, CHOKING",Medically Important
172999,1/7/2014,,SUSPECT,"CENTRUM SILVER WOMEN'S 50+ (MULTIMINERALS, MULTIVITAMINS) TABLET",54, Vit/Min/Prot/Unconv Diet(Human/Animal),86,year(s),F,"CHOKING, DYSPHAGIA",Medically Important
173000,1/7/2014,,SUSPECT,"ONE A DAY MEN'S HEALTH FORMULA (MULTIVITAMINS, MULTIMINERALS) TABLET",54, Vit/Min/Prot/Unconv Diet(Human/Animal),32,year(s),M,CHOKING,Medically Important
173003,1/7/2014,1/1/2014,SUSPECT,TRADER JOES 4 ALMOND CROISSANTS,3, Bakery Prod/Dough/Mix/Icing,,,F,"THROAT IRRITATION, PHARYNGITIS, OESOPHAGEAL INJURY, LACERATION",Other Outcome
173004,1/7/2014,12/17/2013,SUSPECT,BELMONT PEANUTS CHOCO COVERED PEANUT BRITTLE,34, Choc/Cocoa Prod,,,F,"LACERATION, SCRATCH",Patient Visited Healthcare Provider
173006,1/8/2014,9/29/2013,SUSPECT,RESER'S STONEMILL KITCHENS COUNTRY RED POTATO SALAD,39, Prep Salad Prod,,,,"VOMITING, MALAISE, ABDOMINAL PAIN",Other Outcome
173007,1/8/2014,,SUSPECT,"FLINTSTONE IMMUNITY GUMMIES (MULTIVITAMINS, MINERALS, INOSITOL)",54, Vit/Min/Prot/Unconv Diet(Human/Animal),3,year(s),F,CHOKING,Medically Important
173009,1/8/2014,,SUSPECT,"ONE A DAY WOMEN'S (MULTIVITAMINS, MULTIMINERALS) FILM-COATED TABLET",54, Vit/Min/Prot/Unconv Diet(Human/Animal),74,year(s),F,CHOKING,Medically Important
173011,1/8/2014,11/12/2013,SUSPECT,PROTANDIM US,54, Vit/Min/Prot/Unconv Diet(Human/Animal),42,year(s),F,"PALPITATIONS, FEELING JITTERY, ANXIETY","Medically Important, Patient Visited ER"
173012,1/8/2014,11/28/2013,SUSPECT,PROTANDIM US,54, Vit/Min/Prot/Unconv Diet(Human/Animal),74,year(s),M,"ABDOMINAL PAIN, BLOOD URINE PRESENT",Hospitalization
173014,1/8/2014,,SUSPECT,"CENTRUM ULTRA WOMEN'S (MULTIMINERALS, MULTIVITAMINS) TABLET",54, Vit/Min/Prot/Unconv Diet(Human/Animal),89,year(s),F,"CHOKING, DYSPHAGIA",Medically Important
173015,1/8/2014,2/24/2013,SUSPECT,NUTRIMETRIX ISOTONIX OPC-3,54, Vit/Min/Prot/Unconv Diet(Human/Animal),79,year(s),M,"HYPERSOMNIA, RESTLESSNESS, ABNORMAL BEHAVIOUR, INCONTINENCE, CONFUSIONAL STATE, AMNESIA, CRYING, ACTIVITIES OF DAILY LIVING IMPAIRED, HALLUCINATION","Disability, Patient Visited Healthcare Provider"
173015,1/8/2014,2/24/2013,SUSPECT,PRIME ASTAXANTHIN,54, Vit/Min/Prot/Unconv Diet(Human/Animal),79,year(s),M,"HYPERSOMNIA, RESTLESSNESS, ABNORMAL BEHAVIOUR, INCONTINENCE, CONFUSIONAL STATE, AMNESIA, CRYING, ACTIVITIES OF DAILY LIVING IMPAIRED, HALLUCINATION","Disability, Patient Visited Healthcare Provider"
173015,1/8/2014,2/24/2013,SUSPECT,HEART HEALTH OMEGA III FISH OIL,54, Vit/Min/Prot/Unconv Diet(Human/Animal),79,year(s),M,"HYPERSOMNIA, RESTLESSNESS, ABNORMAL BEHAVIOUR, INCONTINENCE, CONFUSIONAL STATE, AMNESIA, CRYING, ACTIVITIES OF DAILY LIVING IMPAIRED, HALLUCINATION","Disability, Patient Visited Healthcare Provider"
173015,1/8/2014,2/24/2013,SUSPECT,BARLEEN'S SALMON OIL,54, Vit/Min/Prot/Unconv Diet(Human/Animal),79,year(s),M,"HYPERSOMNIA, RESTLESSNESS, ABNORMAL BEHAVIOUR, INCONTINENCE, CONFUSIONAL STATE, AMNESIA, CRYING, ACTIVITIES OF DAILY LIVING IMPAIRED, HALLUCINATION","Disability, Patient Visited Healthcare Provider"
173015,1/8/2014,2/24/2013,SUSPECT,METAGENICS CERIVA,54, Vit/Min/Prot/Unconv Diet(Human/Animal),79,year(s),M,"HYPERSOMNIA, RESTLESSNESS, ABNORMAL BEHAVIOUR, INCONTINENCE, CONFUSIONAL STATE, AMNESIA, CRYING, ACTIVITIES OF DAILY LIVING IMPAIRED, HALLUCINATION","Disability, Patient Visited Healthcare Provider"
173015,1/8/2014,2/24/2013,SUSPECT,ISOTONIX ACTIVATED B COMPLEX,54, Vit/Min/Prot/Unconv Diet(Human/Animal),79,year(s),M,"HYPERSOMNIA, RESTLESSNESS, ABNORMAL BEHAVIOUR, INCONTINENCE, CONFUSIONAL STATE, AMNESIA, CRYING, ACTIVITIES OF DAILY LIVING IMPAIRED, HALLUCINATION","Disability, Patient Visited Healthcare Provider"
173015,1/8/2014,2/24/2013,CONCOMITANT,GLYCEROPHOSPHOCHOLINE 600,54, Vit/Min/Prot/Unconv Diet(Human/Animal),79,year(s),M,"HYPERSOMNIA, RESTLESSNESS, ABNORMAL BEHAVIOUR, INCONTINENCE, CONFUSIONAL STATE, AMNESIA, CRYING, ACTIVITIES OF DAILY LIVING IMPAIRED, HALLUCINATION","Disability, Patient Visited Healthcare Provider"
173015,1/8/2014,2/24/2013,CONCOMITANT,LIQUID B12,54, Vit/Min/Prot/Unconv Diet(Human/Animal),79,year(s),M,"HYPERSOMNIA, RESTLESSNESS, ABNORMAL BEHAVIOUR, INCONTINENCE, CONFUSIONAL STATE, AMNESIA, CRYING, ACTIVITIES OF DAILY LIVING IMPAIRED, HALLUCINATION","Disability, Patient Visited Healthcare Provider"
173015,1/8/2014,2/24/2013,CONCOMITANT,LIQUID D (UNPSECIFIED),54, Vit/Min/Prot/Unconv Diet(Human/Animal),79,year(s),M,"HYPERSOMNIA, RESTLESSNESS, ABNORMAL BEHAVIOUR, INCONTINENCE, CONFUSIONAL STATE, AMNESIA, CRYING, ACTIVITIES OF DAILY LIVING IMPAIRED, HALLUCINATION","Disability, Patient Visited Healthcare Provider"
173015,1/8/2014,2/24/2013,CONCOMITANT,PHOSPHATIDYLSERINE 150 MG,54, Vit/Min/Prot/Unconv Diet(Human/Animal),79,year(s),M,"HYPERSOMNIA, RESTLESSNESS, ABNORMAL BEHAVIOUR, INCONTINENCE, CONFUSIONAL STATE, AMNESIA, CRYING, ACTIVITIES OF DAILY LIVING IMPAIRED, HALLUCINATION","Disability, Patient Visited Healthcare Provider"
173015,1/8/2014,2/24/2013,CONCOMITANT,ACETYLCHOLINE 850 MG,54, Vit/Min/Prot/Unconv Diet(Human/Animal),79,year(s),M,"HYPERSOMNIA, RESTLESSNESS, ABNORMAL BEHAVIOUR, INCONTINENCE, CONFUSIONAL STATE, AMNESIA, CRYING, ACTIVITIES OF DAILY LIVING IMPAIRED, HALLUCINATION","Disability, Patient Visited Healthcare Provider"
173016,1/8/2014,9/12/2013,SUSPECT,MOVE FREE,54, Vit/Min/Prot/Unconv Diet(Human/Animal),63,year(s),F,"NAUSEA, CHILLS, ANOREXIA, DYSPNOEA, LIVER INJURY",Hospitalization
173018,1/8/2014,,SUSPECT,"CENTRUM SILVER WOMEN'S 50+ (MULTIMINERALS, MULTIVITAMINS) TABLET",54, Vit/Min/Prot/Unconv Diet(Human/Animal),71,year(s),F,"MUSCLE SPASMS, DRUG INEFFECTIVE, BONE DISORDER, FOOT DEFORMITY, INCORRECT DOSE ADMINISTERED, ABASIA, OVERDOSE",Medically Important
173018,1/8/2014,,SUSPECT,"CALCIUM CARBONATE, CHOLECALCIFEROL (CALCIUM CARBONATE, CHOLECALCIFEROL)",54, Vit/Min/Prot/Unconv Diet(Human/Animal),71,year(s),F,"MUSCLE SPASMS, DRUG INEFFECTIVE, BONE DISORDER, FOOT DEFORMITY, INCORRECT DOSE ADMINISTERED, ABASIA, OVERDOSE",Medically Important
173021,1/8/2014,,SUSPECT,SIMILAC ADVANCED PLUS OR COMPLETE NUTRITION POWERED INFANT FORMULA,40, Baby Food Products,16,month(s),F,VOMITING,Other Outcome
173025,1/8/2014,,SUSPECT,BULK PINE NUTS,23, Nuts/Edible Seed,,,F,"DYSGEUSIA, HYPERSENSITIVITY",Other Outcome
173026,1/8/2014,12/22/2012,SUSPECT,WONDERFUL PISTACHIOS ROASTED & SALTED,23, Nuts/Edible Seed,,,M,"ABDOMINAL PAIN UPPER, DIARRHOEA",Other Outcome
173027,1/8/2014,11/20/2013,SUSPECT,SKIPPY CREAMY STYLE PEANUT BUTTER,23, Nuts/Edible Seed,,,F,"VOMITING, DIARRHOEA",Other Outcome
173028,1/9/2014,,SUSPECT,"CENTRUM SILVER ADULTS 50+ (MULTIMINERALS, MULTIVITAMINS) TABLET",54, Vit/Min/Prot/Unconv Diet(Human/Animal),60,year(s),F,"BURSITIS, EYE DISORDER, EYE INFLAMMATION, UVEITIS, ROTATOR CUFF SYNDROME",Medically Important
173029,1/9/2014,,SUSPECT,"CENTRUM SILVER ADULTS 50+ (MULTIMINERALS, MULTIVITAMINS) TABLET",54, Vit/Min/Prot/Unconv Diet(Human/Animal),,,F,"THROAT IRRITATION, CHOKING",Medically Important
173030,1/9/2014,,SUSPECT,"ONE A DAY WOMEN'S ACTIVE METABOLISM (MULTIVITAMIN, MINERALS, CAFFEINE, CHOLINE) FILM-COATED TABLET",54, Vit/Min/Prot/Unconv Diet(Human/Animal),47,year(s),F,"BLOOD GLUCOSE FLUCTUATION, WRONG TECHNIQUE IN DRUG USAGE PROCESS",Medically Important
173030,1/9/2014,,SUSPECT,TRUBIOTICS (BIFIDOBACTERIUM +LACTOBACILLUS) CAPSULE,54, Vit/Min/Prot/Unconv Diet(Human/Animal),47,year(s),F,"BLOOD GLUCOSE FLUCTUATION, WRONG TECHNIQUE IN DRUG USAGE PROCESS",Medically Important
173032,1/9/2014,,SUSPECT,"CENTRUM SILVER ADULTS 50+ (MULTIMINERALS, MULTIVITAMINS) TABLET",54, Vit/Min/Prot/Unconv Diet(Human/Animal),,,F,CHOKING,Medically Important
173034,1/9/2014,,SUSPECT,"CENTRUM SILVER WOMEN 50+ (MULTIMINERALS, MULTIVITAMINS) TABLET",54, Vit/Min/Prot/Unconv Diet(Human/Animal),,,F,"DYSPHAGIA, CHOKING",Medically Important
173044,1/9/2014,,SUSPECT,CITRACAL REGULAR (CHOLECALCIFEROL + CALCIUM CALTRATE) FILM-COATED TABLET,54, Vit/Min/Prot/Unconv Diet(Human/Animal),,,M,COELIAC DISEASE,Medically Important
173046,1/9/2014,12/2/2013,SUSPECT,CITRACAL PETITES (CHOLECALCIFEROL + CALCIUM CITRATE) FILM-COATED TABELT,54, Vit/Min/Prot/Unconv Diet(Human/Animal),79,year(s),F,CHOKING,Medically Important
173047,1/9/2014,,SUSPECT,CITRACAL MAXIMUM (CHOLECALCIFEROL + CALCIUM CITRATE) FILM-COATED TABLET,54, Vit/Min/Prot/Unconv Diet(Human/Animal),83,year(s),F,CHOKING,Medically Important
173048,1/9/2014,5/21/2013,SUSPECT,OXYELITE PRO SUPER THERMO DIETARY SUPPLEMENT,54, Vit/Min/Prot/Unconv Diet(Human/Animal),,,F,"CHOLELITHIASIS, GALLBLADDER OPERATION, CHOLECYSTITIS INFECTIVE, LIVER INJURY, GALLBLADDER ENLARGEMENT, ABDOMINAL PAIN UPPER","Life Threatening, Hospitalization, Disability, Medically Important"
173049,1/9/2014,,SUSPECT,USP LABS OXYELITE PRO,54, Vit/Min/Prot/Unconv Diet(Human/Animal),32,year(s),F,"RED BLOOD CELL COUNT DECREASED, MALAISE, FATIGUE, ARTHRALGIA, WHITE BLOOD CELL COUNT DECREASED","Patient Visited Healthcare Provider, Medically Important"
173061,1/9/2014,7/1/2013,SUSPECT,EXEMPTION 4,54, Vit/Min/Prot/Unconv Diet(Human/Animal),21,year(s),M,"HALLUCINATION, PARANOIA, DECREASED APPETITE, CARDIAC DISORDER, IRRITABILITY",Disability
173062,1/9/2014,11/30/2013,SUSPECT,GNC HERBAL PLUS STANDARDIZED YOHIMBE,54, Vit/Min/Prot/Unconv Diet(Human/Animal),50,year(s),F,"DIARRHOEA, HYPERSENSITIVITY, TREMOR, NAUSEA, DIZZINESS, HEART RATE INCREASED","Medically Important, Patient Visited ER"
173062,1/9/2014,11/30/2013,CONCOMITANT,MULTIVITAMIN,54, Vit/Min/Prot/Unconv Diet(Human/Animal),50,year(s),F,"DIARRHOEA, HYPERSENSITIVITY, TREMOR, NAUSEA, DIZZINESS, HEART RATE INCREASED","Medically Important, Patient Visited ER"
173063,1/9/2014,12/18/2013,SUSPECT,ORGANIC GRAVESTEIN APPLE JUICE,20, Fruit/Fruit Prod,11,year(s),M,"MALAISE, VOMITING, DIARRHOEA",Medically Important
173064,1/9/2014,12/18/2013,SUSPECT,ORGANIC INFANT PUREE POUCH,22, Fruit/Fruit Prod,14,month(s),F,VOMITING,Medically Important
173066,1/9/2014,,SUSPECT,EXEMPTION 4,41, Dietary Conventional Foods/Meal Replacements,94,year(s),F,"AGITATION, BLOOD GLUCOSE INCREASED, CONFUSIONAL STATE, HEADACHE, COMPULSIONS, INCREASED APPETITE, NIGHTMARE",Medically Important
173066,1/9/2014,,CONCOMITANT,EXEMPTION 4,54, Vit/Min/Prot/Unconv Diet(Human/Animal),94,year(s),F,"AGITATION, BLOOD GLUCOSE INCREASED, CONFUSIONAL STATE, HEADACHE, COMPULSIONS, INCREASED APPETITE, NIGHTMARE",Medically Important
173066,1/9/2014,,CONCOMITANT,EXEMPTION 4,54, Vit/Min/Prot/Unconv Diet(Human/Animal),94,year(s),F,"AGITATION, BLOOD GLUCOSE INCREASED, CONFUSIONAL STATE, HEADACHE, COMPULSIONS, INCREASED APPETITE, NIGHTMARE",Medically Important
173066,1/9/2014,,CONCOMITANT,EXEMPTION 4,54, Vit/Min/Prot/Unconv Diet(Human/Animal),94,year(s),F,"AGITATION, BLOOD GLUCOSE INCREASED, CONFUSIONAL STATE, HEADACHE, COMPULSIONS, INCREASED APPETITE, NIGHTMARE",Medically Important
173066,1/9/2014,,CONCOMITANT,EXEMPTION 4,54, Vit/Min/Prot/Unconv Diet(Human/Animal),94,year(s),F,"AGITATION, BLOOD GLUCOSE INCREASED, CONFUSIONAL STATE, HEADACHE, COMPULSIONS, INCREASED APPETITE, NIGHTMARE",Medically Important
173067,1/9/2014,,SUSPECT,CITRACAL PETITES (CHOLECALCIFEROL + CALCIUM CITRATE) FILM-COATED TABLET,54, Vit/Min/Prot/Unconv Diet(Human/Animal),71,year(s),F,CHOKING,Other Outcome
173067,1/9/2014,,CONCOMITANT,ONE-A-DAY ESSENTIAL (MULTIVITAMINS) TABLET,54, Vit/Min/Prot/Unconv Diet(Human/Animal),71,year(s),F,CHOKING,Other Outcome
173068,1/9/2014,12/1/2013,SUSPECT,NUTRASEA DHA 500 1000 ASCENTA HEALTH LTD.,54, Vit/Min/Prot/Unconv Diet(Human/Animal),87,year(s),F,"HEADACHE, HYPERSENSITIVITY, GENERALISED ERYTHEMA, PRURITUS, SWOLLEN TONGUE, DYSPNOEA",Medically Important
173069,1/9/2014,,SUSPECT,NATUREMADE CALCIUM 600 MG WITH VITAMIN D LIQUID SOFTGEL,54, Vit/Min/Prot/Unconv Diet(Human/Animal),55,year(s),F,"INSOMNIA, PALPITATIONS, CHEST DISCOMFORT, DYSPNOEA","Patient Visited Healthcare Provider, Medically Important"
173069,1/9/2014,,CONCOMITANT,FISH OIL,54, Vit/Min/Prot/Unconv Diet(Human/Animal),55,year(s),F,"INSOMNIA, PALPITATIONS, CHEST DISCOMFORT, DYSPNOEA","Patient Visited Healthcare Provider, Medically Important"
173069,1/9/2014,,CONCOMITANT,MULTIVITAMIN,54, Vit/Min/Prot/Unconv Diet(Human/Animal),55,year(s),F,"INSOMNIA, PALPITATIONS, CHEST DISCOMFORT, DYSPNOEA","Patient Visited Healthcare Provider, Medically Important"
173070,1/9/2014,,SUSPECT,NATUREMADE L-LYSINE 1000 MG,54, Vit/Min/Prot/Unconv Diet(Human/Animal),,,F,FOREIGN BODY TRAUMA,Medically Important