﻿Report ID,CAERS Created Date,Date of Event,Product Type,Product,Product Code,Description,Patient Age,Age Units,Sex,MedDRA Preferred Terms,Outcomes
65325,1/1/2004,8/4/2003,SUSPECT,MIDWEST COUNTRY FAIR CHOCOLATE FLAVORED CHIPS,3, Bakery Prod/Dough/Mix/Icing,2,year(s),F,"SWELLING FACE, RASH, COUGH, WHEEZING, DYSPNOEA, HOSPITALISATION","Hospitalization, Patient Visited Healthcare Provider, Patient Visited ER, Required Intervention"
65327,1/1/2004,11/2/2003,SUSPECT,POST HONEYCOMB STRAWBERRY BLASTED,5, Cereal Prep/Breakfast Food,,,M,MOUTH INJURY,Other Outcome
65333,1/1/2004,,SUSPECT,KROGER CLASSIC CREAM-DE-MINT CANDY MINT CHIP ICE CREAM,13, Ice Cream Prod,,,F,"DIARRHOEA, NAUSEA, DYSGEUSIA",Patient Visited ER
65335,1/1/2004,11/24/2003,SUSPECT,ENFAMIL LIPIL BABY FORMULA,40, Baby Food Products,3,month(s),,"GASTROINTESTINAL DISORDER, VOMITING",Medically Important
65336,1/1/2004,,SUSPECT,ENFIMIL LIPIL BABY FORMULA,40, Baby Food Products,,,,"GASTROINTESTINAL DISORDER, PHYSICAL EXAMINATION",Patient Visited Healthcare Provider
65345,1/1/2004,12/21/2003,SUSPECT,"FRITO LAY FUNYUNS ONION FLAVOR, ONION RINGS",7, Snack Food Item,10,year(s),M,CHOKING,Other Outcome
65350,1/1/2004,,SUSPECT,GRAPE,20, Fruit/Fruit Prod,,,,"CHOKING, DEATH",Death
65353,1/2/2004,12/1/2003,SUSPECT,HERBALIFE RELAX NOW,54, Vit/Min/Prot/Unconv Diet(Human/Animal),,,F,"DELUSION, PHYSICAL EXAMINATION, PARANOIA",Patient Visited Healthcare Provider
65353,1/2/2004,12/1/2003,SUSPECT,HERBALIFE TOTAL CONTROL,54, Vit/Min/Prot/Unconv Diet(Human/Animal),,,F,"DELUSION, PHYSICAL EXAMINATION, PARANOIA",Patient Visited Healthcare Provider
65354,1/2/2004,,SUSPECT,YOHIMBE,54, Vit/Min/Prot/Unconv Diet(Human/Animal),66,year(s),M,BLOOD PRESSURE INCREASED,Required Intervention
65355,1/2/2004,10/27/2003,SUSPECT,CAL-C PEACH TROPIC ENRICHED BEVERAGE BLEND,29, Soft Drink/Water,,,M,"FLUSHING, DIARRHOEA, VOMITING, ABDOMINAL PAIN, RASH, MALAISE, PHYSICAL EXAMINATION, OROPHARYNGEAL SWELLING, LOOSE STOOLS, FAECES PALE",Other Outcome
65356,1/2/2004,10/27/2003,SUSPECT,CAL-C PEACH TROPIC ENRICHED BEVERAGE BLEND,29, Soft Drink/Water,,,,"ABDOMINAL PAIN UPPER, ABDOMINAL PAIN, RASH, VOMITING, LOOSE STOOLS",Other Outcome
65357,1/2/2004,10/27/2003,SUSPECT,CAL-C PEACH TROPIC ENRICHED BEVERAGE BLEND,29, Soft Drink/Water,,,,"ABDOMINAL PAIN UPPER, DIARRHOEA, MALAISE, ABDOMINAL PAIN, RASH, VOMITING, LOOSE STOOLS",Other Outcome
65379,1/3/2004,11/5/2003,SUSPECT,I CONTACT LIP-INK (SEMI-PERMANENT),53, Cosmetics,,,F,"SWELLING FACE, PARAESTHESIA ORAL",Other Outcome
65387,1/3/2004,,SUSPECT,H.P. HOOD HALF AND HALF,9, Milk/Butter/Dried Milk Prod,,,F,PHARYNGITIS,Other Outcome
65388,1/3/2004,12/30/2003,SUSPECT,LACTAID REDUCED FAT (2%) MILK; 100% LACTOSE FREE,9, Milk/Butter/Dried Milk Prod,,,M,VOMITING,Other Outcome
65399,1/5/2004,11/22/2003,SUSPECT,METOBOLITE 356,54, Vit/Min/Prot/Unconv Diet(Human/Animal),51,year(s),M,"COMPLETED SUICIDE, STRESS, DEATH",Death
65400,1/5/2004,9/5/2001,SUSPECT,METABOLIFE,54, Vit/Min/Prot/Unconv Diet(Human/Animal),45,year(s),F,"DEATH, MITRAL VALVE DISEASE","Death, Patient Visited Healthcare Provider"
65403,1/5/2004,3/4/2003,SUSPECT,METABOLIFE METABOLIFE,54, Vit/Min/Prot/Unconv Diet(Human/Animal),54,year(s),F,CEREBROVASCULAR ACCIDENT,"Life Threatening, Hospitalization, Patient Visited Healthcare Provider, Patient Visited ER"
65404,1/5/2004,,SUSPECT,ENIVA MINERALS FOR LIFE-SILVER,54, Vit/Min/Prot/Unconv Diet(Human/Animal),16,year(s),M,"MUCOSAL DISCOLOURATION, SKIN DISCOLOURATION",Patient Visited Healthcare Provider
65416,1/6/2004,11/15/2003,SUSPECT,AVLIMIL,54, Vit/Min/Prot/Unconv Diet(Human/Animal),36,year(s),F,"HEART RATE INCREASED, DIZZINESS, BLOOD PRESSURE INCREASED, PALPITATIONS",Patient Visited Healthcare Provider
65418,1/6/2004,,SUSPECT,HANNAFORD'S CENTRAL-VITE,54, Vit/Min/Prot/Unconv Diet(Human/Animal),79,year(s),F,"FAECAL INCONTINENCE, URINARY INCONTINENCE","Life Threatening, Disability, Required Intervention"
65419,1/6/2004,,SUSPECT,AVLIMIL,54, Vit/Min/Prot/Unconv Diet(Human/Animal),48,year(s),F,PAIN IN EXTREMITY,Other Outcome
65420,1/6/2004,11/1/2003,SUSPECT,NUTRASWEET,45, Food Additives (Human Use),33,year(s),M,"PALPITATIONS, DIZZINESS, PARAESTHESIA, HOSPITALISATION, CHEST PAIN, PHYSICAL EXAMINATION, EXTRASYSTOLES, VENTRICULAR EXTRASYSTOLES, ORTHOSTATIC HYPOTENSION","Life Threatening, Hospitalization, Disability"
65420,1/6/2004,11/1/2003,SUSPECT,DIET COKE,29, Soft Drink/Water,33,year(s),M,"PALPITATIONS, DIZZINESS, PARAESTHESIA, HOSPITALISATION, CHEST PAIN, PHYSICAL EXAMINATION, EXTRASYSTOLES, VENTRICULAR EXTRASYSTOLES, ORTHOSTATIC HYPOTENSION","Life Threatening, Hospitalization, Disability"
65420,1/6/2004,11/1/2003,SUSPECT,LISTERINE STRIPS,53, Cosmetics,33,year(s),M,"PALPITATIONS, DIZZINESS, PARAESTHESIA, HOSPITALISATION, CHEST PAIN, PHYSICAL EXAMINATION, EXTRASYSTOLES, VENTRICULAR EXTRASYSTOLES, ORTHOSTATIC HYPOTENSION","Life Threatening, Hospitalization, Disability"
65420,1/6/2004,11/1/2003,SUSPECT,DIET PEPSI,29, Soft Drink/Water,33,year(s),M,"PALPITATIONS, DIZZINESS, PARAESTHESIA, HOSPITALISATION, CHEST PAIN, PHYSICAL EXAMINATION, EXTRASYSTOLES, VENTRICULAR EXTRASYSTOLES, ORTHOSTATIC HYPOTENSION","Life Threatening, Hospitalization, Disability"
65420,1/6/2004,11/1/2003,SUSPECT,DIET SPRITE,29, Soft Drink/Water,33,year(s),M,"PALPITATIONS, DIZZINESS, PARAESTHESIA, HOSPITALISATION, CHEST PAIN, PHYSICAL EXAMINATION, EXTRASYSTOLES, VENTRICULAR EXTRASYSTOLES, ORTHOSTATIC HYPOTENSION","Life Threatening, Hospitalization, Disability"
65420,1/6/2004,11/1/2003,SUSPECT,JAMS,22, Fruit/Fruit Prod,33,year(s),M,"PALPITATIONS, DIZZINESS, PARAESTHESIA, HOSPITALISATION, CHEST PAIN, PHYSICAL EXAMINATION, EXTRASYSTOLES, VENTRICULAR EXTRASYSTOLES, ORTHOSTATIC HYPOTENSION","Life Threatening, Hospitalization, Disability"
65420,1/6/2004,11/1/2003,SUSPECT,PUDDINGS,35, Gelatin/Rennet/Pudding Mix/Pie Filling,33,year(s),M,"PALPITATIONS, DIZZINESS, PARAESTHESIA, HOSPITALISATION, CHEST PAIN, PHYSICAL EXAMINATION, EXTRASYSTOLES, VENTRICULAR EXTRASYSTOLES, ORTHOSTATIC HYPOTENSION","Life Threatening, Hospitalization, Disability"
65420,1/6/2004,11/1/2003,SUSPECT,DIET CAFFEINE FREE COKE,29, Soft Drink/Water,33,year(s),M,"PALPITATIONS, DIZZINESS, PARAESTHESIA, HOSPITALISATION, CHEST PAIN, PHYSICAL EXAMINATION, EXTRASYSTOLES, VENTRICULAR EXTRASYSTOLES, ORTHOSTATIC HYPOTENSION","Life Threatening, Hospitalization, Disability"
65420,1/6/2004,11/1/2003,SUSPECT,TEA,31, Coffee/Tea,33,year(s),M,"PALPITATIONS, DIZZINESS, PARAESTHESIA, HOSPITALISATION, CHEST PAIN, PHYSICAL EXAMINATION, EXTRASYSTOLES, VENTRICULAR EXTRASYSTOLES, ORTHOSTATIC HYPOTENSION","Life Threatening, Hospitalization, Disability"
65420,1/6/2004,11/1/2003,SUSPECT,COFFEE,31, Coffee/Tea,33,year(s),M,"PALPITATIONS, DIZZINESS, PARAESTHESIA, HOSPITALISATION, CHEST PAIN, PHYSICAL EXAMINATION, EXTRASYSTOLES, VENTRICULAR EXTRASYSTOLES, ORTHOSTATIC HYPOTENSION","Life Threatening, Hospitalization, Disability"
65421,1/6/2004,8/21/2003,SUSPECT,DIET COKE,29, Soft Drink/Water,14,year(s),M,ALOPECIA,Other Outcome
65421,1/6/2004,8/21/2003,SUSPECT,TOOTHPASTE,53, Cosmetics,14,year(s),M,ALOPECIA,Other Outcome
65421,1/6/2004,8/21/2003,SUSPECT,GATORADE SPORTS DRINK,29, Soft Drink/Water,14,year(s),M,ALOPECIA,Other Outcome
65422,1/6/2004,5/24/2003,SUSPECT,FLEXIUM SAM-E,54, Vit/Min/Prot/Unconv Diet(Human/Animal),59,year(s),F,"ALOPECIA, ARTHRALGIA, DERMATOLOGIC EXAMINATION, HEADACHE, HYPERSENSITIVITY, HYPOTRICHOSIS, PHYSICAL EXAMINATION",Patient Visited Healthcare Provider
65423,1/6/2004,1/1/1996,SUSPECT,BREATHE EASY TEA,54, Vit/Min/Prot/Unconv Diet(Human/Animal),,,F,"PALPITATIONS, PARANOIA, PSYCHOTIC DISORDER, HYPERVENTILATION",Other Outcome
65424,1/6/2004,,SUSPECT,RIPPED FUEL,54, Vit/Min/Prot/Unconv Diet(Human/Animal),33,year(s),F,"TREMOR, FACIAL PALSY","Patient Visited Healthcare Provider, Required Intervention"
65425,1/6/2004,,SUSPECT,SIBERIAN GINSENG,54, Vit/Min/Prot/Unconv Diet(Human/Animal),29,year(s),M,"DIZZINESS, BODY TEMPERATURE INCREASED",Patient Visited Healthcare Provider
65426,1/6/2004,11/6/1998,SUSPECT,EPHEDRA,54, Vit/Min/Prot/Unconv Diet(Human/Animal),43,year(s),M,"HOSPITALISATION, MYOCARDIAL INFARCTION","Life Threatening, Hospitalization, Disability"
65427,1/6/2004,,SUSPECT,METABOLIFE,54, Vit/Min/Prot/Unconv Diet(Human/Animal),27,year(s),F,PERIPHERAL VASCULAR DISORDER,Patient Visited Healthcare Provider
65427,1/6/2004,,SUSPECT,PRODUCTS CONTAINING EPHEDRA,54, Vit/Min/Prot/Unconv Diet(Human/Animal),27,year(s),F,PERIPHERAL VASCULAR DISORDER,Patient Visited Healthcare Provider
65430,1/6/2004,,SUSPECT,EPHEDRINE MULTI-ACTION,54, Vit/Min/Prot/Unconv Diet(Human/Animal),42,year(s),M,"COUGH, CHEST PAIN",Other Outcome
65431,1/6/2004,,SUSPECT,STACKER 3 WITH CHITOSAN EPHEDRA FREE FORMULA,54, Vit/Min/Prot/Unconv Diet(Human/Animal),40,year(s),F,"FEELING COLD, DIZZINESS, HEART RATE INCREASED, ABDOMINAL PAIN UPPER, FEELING ABNORMAL, LOSS OF CONSCIOUSNESS, TREMOR, HYPOTENSION, DEHYDRATION",Patient Visited Healthcare Provider
65432,1/6/2004,12/5/2003,SUSPECT,ZANTREX 3,54, Vit/Min/Prot/Unconv Diet(Human/Animal),51,year(s),F,"ERYTHEMA, PARAESTHESIA, FLUSHING",Patient Visited ER
65433,1/6/2004,7/1/2002,SUSPECT,XENADRINE,54, Vit/Min/Prot/Unconv Diet(Human/Animal),35,year(s),F,"HEADACHE, PAIN, TENDERNESS",Other Outcome
65435,1/6/2004,12/31/2003,SUSPECT,ROMA PIZZA,37, Mult Food Dinner/Grav/Sauce/Special,19,year(s),M,FOOD POISONING,Other Outcome
65436,1/6/2004,12/31/2003,SUSPECT,ROMA PIZZA,37, Mult Food Dinner/Grav/Sauce/Special,,,,FOOD POISONING,Other Outcome
65437,1/6/2004,12/31/2003,SUSPECT,ROMA PIZZA,37, Mult Food Dinner/Grav/Sauce/Special,,,,FOOD POISONING,Other Outcome
65438,1/6/2004,11/1/2003,SUSPECT,NUTRASWEET,45, Food Additives (Human Use),,,F,"ARRHYTHMIA, BALANCE DISORDER, BLOOD PRESSURE INCREASED, CHEST PAIN, DIZZINESS, EAR, NOSE AND THROAT EXAMINATION, EXTRASYSTOLES, HOSPITALISATION, HYPERSENSITIVITY, ORTHOSTATIC HYPOTENSION, PALPITATIONS, PARAESTHESIA, PHYSICAL EXAMINATION, TINNITUS, VENTRICULAR EXTRASYSTOLES","Life Threatening, Disability"
65438,1/6/2004,11/1/2003,SUSPECT,DIET COKE,29, Soft Drink/Water,,,F,"ARRHYTHMIA, BALANCE DISORDER, BLOOD PRESSURE INCREASED, CHEST PAIN, DIZZINESS, EAR, NOSE AND THROAT EXAMINATION, EXTRASYSTOLES, HOSPITALISATION, HYPERSENSITIVITY, ORTHOSTATIC HYPOTENSION, PALPITATIONS, PARAESTHESIA, PHYSICAL EXAMINATION, TINNITUS, VENTRICULAR EXTRASYSTOLES","Life Threatening, Disability"
65438,1/6/2004,11/1/2003,SUSPECT,JAMS,22, Fruit/Fruit Prod,,,F,"ARRHYTHMIA, BALANCE DISORDER, BLOOD PRESSURE INCREASED, CHEST PAIN, DIZZINESS, EAR, NOSE AND THROAT EXAMINATION, EXTRASYSTOLES, HOSPITALISATION, HYPERSENSITIVITY, ORTHOSTATIC HYPOTENSION, PALPITATIONS, PARAESTHESIA, PHYSICAL EXAMINATION, TINNITUS, VENTRICULAR EXTRASYSTOLES","Life Threatening, Disability"
65438,1/6/2004,11/1/2003,SUSPECT,PUDDINGS,35, Gelatin/Rennet/Pudding Mix/Pie Filling,,,F,"ARRHYTHMIA, BALANCE DISORDER, BLOOD PRESSURE INCREASED, CHEST PAIN, DIZZINESS, EAR, NOSE AND THROAT EXAMINATION, EXTRASYSTOLES, HOSPITALISATION, HYPERSENSITIVITY, ORTHOSTATIC HYPOTENSION, PALPITATIONS, PARAESTHESIA, PHYSICAL EXAMINATION, TINNITUS, VENTRICULAR EXTRASYSTOLES","Life Threatening, Disability"
65438,1/6/2004,11/1/2003,SUSPECT,DIET CAFFEINE FREE COKE,29, Soft Drink/Water,,,F,"ARRHYTHMIA, BALANCE DISORDER, BLOOD PRESSURE INCREASED, CHEST PAIN, DIZZINESS, EAR, NOSE AND THROAT EXAMINATION, EXTRASYSTOLES, HOSPITALISATION, HYPERSENSITIVITY, ORTHOSTATIC HYPOTENSION, PALPITATIONS, PARAESTHESIA, PHYSICAL EXAMINATION, TINNITUS, VENTRICULAR EXTRASYSTOLES","Life Threatening, Disability"
65438,1/6/2004,11/1/2003,SUSPECT,COFFEE,31, Coffee/Tea,,,F,"ARRHYTHMIA, BALANCE DISORDER, BLOOD PRESSURE INCREASED, CHEST PAIN, DIZZINESS, EAR, NOSE AND THROAT EXAMINATION, EXTRASYSTOLES, HOSPITALISATION, HYPERSENSITIVITY, ORTHOSTATIC HYPOTENSION, PALPITATIONS, PARAESTHESIA, PHYSICAL EXAMINATION, TINNITUS, VENTRICULAR EXTRASYSTOLES","Life Threatening, Disability"
65439,1/6/2004,12/15/2003,SUSPECT,DORMANS SWISS CHEESE,12, Cheese/Cheese Prod,4,year(s),F,MALAISE,Other Outcome
65440,1/6/2004,10/28/2003,SUSPECT,HERBS FOR LIFE GHR-GOLDALL NATURAL GROWTH HORMONE RELEASER NUTRITIONAL SUPPLEMENT,54, Vit/Min/Prot/Unconv Diet(Human/Animal),73,year(s),M,DEATH,"Death, Life Threatening, Hospitalization, Patient Visited Healthcare Provider"
65443,1/6/2004,3/7/2003,SUSPECT,MARUCHAN CREAMY PESTO INSTANT LUNCH NOODLES,4, Macaroni/Noodle Prod,,,,"MALAISE, NAUSEA, DIZZINESS, ASTHENIA",Other Outcome
65450,1/6/2004,4/7/2003,SUSPECT,SUNSWEET PRUNES,21, Fruit/Fruit Prod,,,F,ABDOMINAL PAIN UPPER,Other Outcome
65457,1/6/2004,11/22/2003,SUSPECT,VICENZI NOCCIOLA (COOKIES),3, Bakery Prod/Dough/Mix/Icing,,,M,ORAL DISCOMFORT,"Patient Visited Healthcare Provider, Patient Visited ER"
65465,1/6/2004,,SUSPECT,YEO HIAP SENG (M) BHD YEO'S SOYA BEAN DRINK VIETAMESE STYLE,24, Vegetables/Vegetable Products,,,M,HAEMATOCHEZIA,Patient Visited Healthcare Provider
65468,1/6/2004,12/15/2003,SUSPECT,JELLO OREO PUDDING SNACKS,35, Gelatin/Rennet/Pudding Mix/Pie Filling,10,year(s),M,"ABDOMINAL PAIN, MALAISE, VOMITING, DIARRHOEA",Other Outcome
65473,1/6/2004,1/3/2004,SUSPECT,SNAPPLE DIET LEMON ICED TEA,31, Coffee/Tea,,,F,"MALAISE, VOMITING, DIARRHOEA, GASTROINTESTINAL DISORDER, DEFAECATION URGENCY",Patient Visited Healthcare Provider
65486,1/7/2004,,SUSPECT,TOPS BRAND FROSTED FLAKES (CORN FLAKES),5, Cereal Prep/Breakfast Food,,,F,"HYPOAESTHESIA ORAL, DIARRHOEA, PARAESTHESIA",Other Outcome
65487,1/7/2004,,SUSPECT,ENSURE DRINK,41, Dietary Conventional Foods/Meal Replacements,,,F,"DYSGEUSIA, HEADACHE, FLATULENCE, ABDOMINAL PAIN, DIARRHOEA",Other Outcome
65489,1/7/2004,11/23/2003,SUSPECT,REESE'S FAST BREAK PEANUT BUTTER AND NOUGAT CHOCOLATE BAR,34, Choc/Cocoa Prod,,,M,"REACTION TO FOOD ADDITIVE, NAUSEA",Other Outcome
65491,1/7/2004,12/23/2002,SUSPECT,SUNDOWN SAW PALMETTO,54, Vit/Min/Prot/Unconv Diet(Human/Animal),65,year(s),M,"EPISTAXIS, HOSPITALISATION","Life Threatening, Patient Visited Healthcare Provider, Patient Visited ER"
65496,1/7/2004,1/5/2004,SUSPECT,"CLASSICO PASTA SAUCE, TOMATO AND BASIL",37, Mult Food Dinner/Grav/Sauce/Special,,,F,VOMITING,Other Outcome
65497,1/7/2004,7/17/2003,SUSPECT,FRITO LAY WAVY RANCH POTATO CHIPS,7, Snack Food Item,,,M,"HYPERHIDROSIS, MALAISE, VOMITING",Patient Visited Healthcare Provider
65508,1/8/2004,8/9/2002,SUSPECT,POST WAFFLE CRISP,5, Cereal Prep/Breakfast Food,2,year(s),F,"DIARRHOEA, VOMITING, DYSPEPSIA","Patient Visited Healthcare Provider, Patient Visited ER"
65509,1/8/2004,6/16/2003,SUSPECT,POPSICLES SPIDERMAN FIRECRACKER SUPER HEROES POPSICLES,13, Ice Cream Prod,,,F,CHOKING,Other Outcome
65510,1/8/2004,,SUSPECT,CAPRI SUN FRUIT PUNCH,21, Fruit/Fruit Prod,9,year(s),F,DYSPEPSIA,Other Outcome
65513,1/8/2004,,SUSPECT,JADRANKA TRADITIONAL PASTEURIZED RED PEPPERS,24, Vegetables/Vegetable Products,59,year(s),F,"ANXIETY, DIARRHOEA, VOMITING, HEADACHE, FATIGUE, ASTHENIA, SALIVARY HYPERSECRETION, MOOD ALTERED, VISUAL DISTURBANCE",Other Outcome
65516,1/8/2004,,SUSPECT,AVACOR NUTRA CAP TABLETS,54, Vit/Min/Prot/Unconv Diet(Human/Animal),,,F,"HYPOTRICHOSIS, TRICHORRHEXIS, UNEXPECTED THERAPEUTIC DRUG EFFECT",Other Outcome
65516,1/8/2004,,SUSPECT,AVACOR SHAMPOO,53, Cosmetics,,,F,"HYPOTRICHOSIS, TRICHORRHEXIS, UNEXPECTED THERAPEUTIC DRUG EFFECT",Other Outcome
65517,1/8/2004,11/3/2003,SUSPECT,SOY BITE COOKIE (SOYBEAN),3, Bakery Prod/Dough/Mix/Icing,,,M,DIARRHOEA,Other Outcome
65518,1/8/2004,11/4/2003,SUSPECT,MCCORMICK SALAD TOPPINS,23, Nuts/Edible Seed,,,F,"HYPERSENSITIVITY, DYSPNOEA, HYPERHIDROSIS, TREMOR, FEELING COLD","Patient Visited ER, Required Intervention"
65519,1/8/2004,11/12/2003,SUSPECT,GRILYAZZH RASPBERRY CANDY NUTS,33, Candy W/O Choc/Special/Chew Gum,,,M,HYPERSENSITIVITY,Other Outcome
65520,1/8/2004,,SUSPECT,BALANCE BAR CHOCOLATE CRUNCH,7, Snack Food Item,,,M,DIARRHOEA,Other Outcome
65521,1/8/2004,11/19/2003,SUSPECT,BAKER'S OVEN PUMPKIN PIE,35, Gelatin/Rennet/Pudding Mix/Pie Filling,,,M,"HYPERHIDROSIS, DIARRHOEA, RIGORS, PAIN",Other Outcome
65523,1/8/2004,11/12/2003,SUSPECT,LANCE TOAST CHEESE SNACK CRACKERS,3, Bakery Prod/Dough/Mix/Icing,,,M,"PHYSICAL EXAMINATION, DIARRHOEA, HEADACHE, ABDOMINAL PAIN UPPER",Patient Visited ER
65528,1/8/2004,12/14/2003,SUSPECT,M AND M PEANUT CANDIES,34, Choc/Cocoa Prod,,,F,"ASTHENIA, DIARRHOEA, NAUSEA, MYALGIA",Patient Visited Healthcare Provider
65529,1/8/2004,,SUSPECT,DEAD SEA RUM FACIAL CREAM,53, Cosmetics,,,F,"BURNING SENSATION, ERYTHEMA, SKIN DISCOLOURATION",Other Outcome
65532,1/8/2004,,SUSPECT,COCA-COLA VANILLA COKE,29, Soft Drink/Water,15,year(s),F,ABDOMINAL PAIN UPPER,Other Outcome
65533,1/8/2004,12/2/2003,SUSPECT,POLAND SPRINGS SPRING WATER,29, Soft Drink/Water,,,M,"DIARRHOEA, NAUSEA, ABDOMINAL PAIN, RIGORS",Other Outcome
65545,1/9/2004,6/3/2003,SUSPECT,V8 VEGETABLE JUICE,24, Vegetables/Vegetable Products,,,M,"VOMITING, DIARRHOEA",Patient Visited Healthcare Provider
65546,1/9/2004,6/24/2003,SUSPECT,BUNNY LOVE FRESH BABY CARROTS,25, Vegetables/Vegetable Products,66,year(s),F,"DYSPNOEA, VISION BLURRED, EMERGENCY CARE EXAMINATION, THROAT TIGHTNESS, HOSPITALISATION, EYE IRRITATION, SNEEZING, EYE OEDEMA, EYE PRURITUS, SINUS PAIN","Hospitalization, Patient Visited Healthcare Provider, Patient Visited ER"
65549,1/9/2004,11/2/2003,SUSPECT,MISTIC SPARKLING LIME KIWI WATER,29, Soft Drink/Water,28,year(s),F,"BURNING SENSATION, NAUSEA, ABDOMINAL PAIN UPPER, HOSPITALISATION, DRY THROAT","Hospitalization, Patient Visited ER"
65553,1/9/2004,12/3/2003,SUSPECT,OTIS SPUNKMEYERS BANANA NUT MUFFINS,3, Bakery Prod/Dough/Mix/Icing,13,year(s),F,"NAUSEA, THROAT IRRITATION",Patient Visited Healthcare Provider
65554,1/9/2004,,SUSPECT,BUTTER FINGERS PEANUT BUTTER CANDIES,34, Choc/Cocoa Prod,,,F,"NAUSEA, ABDOMINAL PAIN",Patient Visited Healthcare Provider
65555,1/9/2004,12/4/2003,SUSPECT,HARRY AND DAVID'S RASPBERRY CHOCOLATE COVERED TRUFFLES,34, Choc/Cocoa Prod,,,F,"THROAT IRRITATION, VOMITING, URTICARIA, CHEST PAIN, ABDOMINAL PAIN, MEDICATION ERROR",Patient Visited Healthcare Provider
65557,1/9/2004,11/1/2003,SUSPECT,VITA SHRIMP COCKTAIL,16, Fishery/Seafood Prod,,,F,"LOOSE STOOLS, FLATULENCE",Other Outcome
65559,1/9/2004,,SUSPECT,SKIPPY SKIPPY SQUEEZE IT,23, Nuts/Edible Seed,,,M,"MALAISE, VOMITING, HOSPITALISATION","Hospitalization, Patient Visited ER"
65569,1/9/2004,,SUSPECT,SUBWAY CHICKEN WRAP SANDWICH,37, Mult Food Dinner/Grav/Sauce/Special,17,year(s),F,"DYSPNOEA, HYPERSENSITIVITY, EMERGENCY CARE EXAMINATION, ERYTHEMA, SWELLING FACE, BLOOD PRESSURE DECREASED","Patient Visited ER, Required Intervention"
65570,1/9/2004,,SUSPECT,MAYONNAISE,27, Dressing/Condiment,,,F,"ABDOMINAL DISTENSION, DIARRHOEA, VOMITING, NAUSEA, FLATULENCE, CHEST PAIN",Other Outcome
65578,1/10/2004,1/1/2003,SUSPECT,SALLY HANSEN BRUSH-ON BIKINI HAIR REMOVER CREAM,53, Cosmetics,25,year(s),F,"SKIN BLEEDING, ERYTHEMA, PHYSICAL EXAMINATION, BLISTER, SKIN BURNING SENSATION, BURNS SECOND DEGREE",Patient Visited Healthcare Provider
65580,1/10/2004,3/31/2003,SUSPECT,"CAMELOT WATER, SPRING",29, Soft Drink/Water,,,F,ABDOMINAL PAIN,Other Outcome
65594,1/10/2004,,SUSPECT,WESTERN FAMILY 18 ASSORTED FLAVOR TWIN POPS,13, Ice Cream Prod,,,F,HYPOAESTHESIA ORAL,Other Outcome
65595,1/10/2004,12/24/2003,SUSPECT,GIANT EAGLE 100% APPLE JUICE FROM CONCENTRATE,20, Fruit/Fruit Prod,,,F,"HEADACHE, PYREXIA, PHARYNGOLARYNGEAL PAIN, NASAL CONGESTION",Other Outcome
65596,1/10/2004,12/16/2003,SUSPECT,M AND M PEANUT CANDY,33, Candy W/O Choc/Special/Chew Gum,,,F,VOMITING,Other Outcome
65597,1/10/2004,,SUSPECT,KELLOGG'S FRUIT AND HARVEST CEREAL,5, Cereal Prep/Breakfast Food,,,F,"PHARYNGITIS, CAUSTIC INJURY",Other Outcome
65598,1/10/2004,,SUSPECT,DOLE APPLE JUICE,20, Fruit/Fruit Prod,,,M,MALAISE,Other Outcome
65610,1/11/2004,,SUSPECT,LUNA NUTS OVER CHOCOLATE ENERGY BAR,7, Snack Food Item,,,M,"DIARRHOEA, NAUSEA",Other Outcome
65611,1/11/2004,6/30/2003,SUSPECT,HERSHEY'S CHOCOLATE BARS,34, Choc/Cocoa Prod,,,F,VOMITING,Patient Visited ER
65613,1/11/2004,7/7/2003,SUSPECT,GREEN GIANT SPINACH WITH NO SAUCE,24, Vegetables/Vegetable Products,,,M,NAUSEA,Other Outcome
65615,1/12/2004,12/2/2003,SUSPECT,POLAND SPRINGS SPRING WATER,29, Soft Drink/Water,4,year(s),F,"MALAISE, DIARRHOEA, NAUSEA, ABDOMINAL PAIN, RIGORS",Other Outcome
65616,1/12/2004,9/21/2003,SUSPECT,GOOD DAY 1% LOWFAT MILK,9, Milk/Butter/Dried Milk Prod,,,M,PARAESTHESIA ORAL,Other Outcome
65617,1/12/2004,9/21/2003,SUSPECT,GOOD DAY 1% LOWFAT MILK,9, Milk/Butter/Dried Milk Prod,,,F,PARAESTHESIA ORAL,Other Outcome
65618,1/12/2004,9/21/2003,SUSPECT,GOOD DAY 1% LOWFAT MILK,9, Milk/Butter/Dried Milk Prod,3,year(s),M,PARAESTHESIA ORAL,Other Outcome
65619,1/12/2004,12/22/2003,SUSPECT,ACEYTL-L-CARNITINE,54, Vit/Min/Prot/Unconv Diet(Human/Animal),70,year(s),M,"IMPAIRED DRIVING ABILITY, DIZZINESS, ASTHENIA, PHYSICAL EXAMINATION, DEPRESSED MOOD, LETHARGY",Disability
65619,1/12/2004,12/22/2003,SUSPECT,ALPHA LIPOIC,54, Vit/Min/Prot/Unconv Diet(Human/Animal),70,year(s),M,"IMPAIRED DRIVING ABILITY, DIZZINESS, ASTHENIA, PHYSICAL EXAMINATION, DEPRESSED MOOD, LETHARGY",Disability
65619,1/12/2004,12/22/2003,SUSPECT,CALCIUM CALTRATE,54, Vit/Min/Prot/Unconv Diet(Human/Animal),70,year(s),M,"IMPAIRED DRIVING ABILITY, DIZZINESS, ASTHENIA, PHYSICAL EXAMINATION, DEPRESSED MOOD, LETHARGY",Disability
65619,1/12/2004,12/22/2003,SUSPECT,VITAMIN E,54, Vit/Min/Prot/Unconv Diet(Human/Animal),70,year(s),M,"IMPAIRED DRIVING ABILITY, DIZZINESS, ASTHENIA, PHYSICAL EXAMINATION, DEPRESSED MOOD, LETHARGY",Disability
65619,1/12/2004,12/22/2003,SUSPECT,MULTIVITAMIN,54, Vit/Min/Prot/Unconv Diet(Human/Animal),70,year(s),M,"IMPAIRED DRIVING ABILITY, DIZZINESS, ASTHENIA, PHYSICAL EXAMINATION, DEPRESSED MOOD, LETHARGY",Disability
65622,1/12/2004,6/26/2003,SUSPECT,EPHEDRA,54, Vit/Min/Prot/Unconv Diet(Human/Animal),54,year(s),F,"FEELING ABNORMAL, HEART RATE INCREASED, MUSCLE INJURY, PALPITATIONS, TACHYCARDIA","Life Threatening, Patient Visited Healthcare Provider, Required Intervention"
65622,1/12/2004,6/26/2003,CONCOMITANT,ONE A DAY MULTIVITAMIN,54, Vit/Min/Prot/Unconv Diet(Human/Animal),54,year(s),F,"FEELING ABNORMAL, HEART RATE INCREASED, MUSCLE INJURY, PALPITATIONS, TACHYCARDIA","Life Threatening, Patient Visited Healthcare Provider, Required Intervention"
65622,1/12/2004,6/26/2003,CONCOMITANT,PRIMROSE OIL,54, Vit/Min/Prot/Unconv Diet(Human/Animal),54,year(s),F,"FEELING ABNORMAL, HEART RATE INCREASED, MUSCLE INJURY, PALPITATIONS, TACHYCARDIA","Life Threatening, Patient Visited Healthcare Provider, Required Intervention"
65622,1/12/2004,6/26/2003,CONCOMITANT,VITAMIN E,54, Vit/Min/Prot/Unconv Diet(Human/Animal),54,year(s),F,"FEELING ABNORMAL, HEART RATE INCREASED, MUSCLE INJURY, PALPITATIONS, TACHYCARDIA","Life Threatening, Patient Visited Healthcare Provider, Required Intervention"
65622,1/12/2004,6/26/2003,CONCOMITANT,CALCIUM,54, Vit/Min/Prot/Unconv Diet(Human/Animal),54,year(s),F,"FEELING ABNORMAL, HEART RATE INCREASED, MUSCLE INJURY, PALPITATIONS, TACHYCARDIA","Life Threatening, Patient Visited Healthcare Provider, Required Intervention"
65624,1/12/2004,,SUSPECT,GIANT EAGLE 100% APPLE JUICE FROM CONCENTRATE,20, Fruit/Fruit Prod,,,,"HEADACHE, DIARRHOEA, PYREXIA, NASAL CONGESTION",Other Outcome
65625,1/12/2004,,SUSPECT,GIANT EAGLE 100% APPLE JUICE FROM CONCENTRATE,20, Fruit/Fruit Prod,,,,"HEADACHE, DIARRHOEA, PYREXIA, NASAL CONGESTION",Other Outcome
65626,1/12/2004,,SUSPECT,GIANT EAGLE 100% APPLE JUICE FROM CONCENTRATE,20, Fruit/Fruit Prod,,,,"PYREXIA, HEADACHE, PHARYNGITIS, NASAL CONGESTION",Other Outcome
65637,1/13/2004,3/7/2003,SUSPECT,MARUCHAN CREAMY PESTO INSTANT LUNCH NOODLES,4, Macaroni/Noodle Prod,,,,"MALAISE, NAUSEA, DIZZINESS, ASTHENIA",Other Outcome
65638,1/13/2004,3/7/2003,SUSPECT,MARUCHAN CREAMY PESTO INSTANT LUNCH NOODLES,4, Macaroni/Noodle Prod,,,,"MALAISE, NAUSEA, DIZZINESS, ASTHENIA",Other Outcome
65639,1/13/2004,3/7/2003,SUSPECT,MARUCHAN CREAMY PESTO INSTANT LUNCH NOODLES,4, Macaroni/Noodle Prod,,,,"DIZZINESS, NAUSEA, ASTHENIA",Other Outcome