DATE_FDA_FIRST_RECEIVED_REPORT,REPORT_ID,DATE_EVENT,PRODUCT_TYPE,PRODUCT,PRODUCT_CODE,DESCRIPTION,PATIENT_AGE,AGE_UNITS,SEX,CASE_MEDDRA_PREFERRED_TERMS,CASE_OUTCOME
9/30/2022,2022-CFS-014640,,SUSPECT,CENTRUM SILVER MEN'S 50+,54,Vit/Min/Prot/Unconv Diet(Human/Animal),,,Male,Foreign body in throat,Other Serious Outcome
9/30/2022,2022-CFS-014637,8/26/2022,SUSPECT,YOUNIQUE DAILY YOU LIQUID COLLAGEN SHOT,53,Cosmetics,42.00,year(s),Female,"Abdominal distension, Hypersensitivity, Rash, Swelling","Life Threatening, Hospitalization"
9/30/2022,2022-CFS-014636,,SUSPECT,CITRACAL CALCIUM CITRATE,54,Vit/Min/Prot/Unconv Diet(Human/Animal),,,,Choking,"Other Serious or Important Medical Event, Other Serious Outcome"
9/30/2022,2022-CFS-014635,4/14/2022,SUSPECT,TRADER JOE'S GLUTEN FREE OATS,02,Whole Grain/Milled Grain Prod/Starch,40.00,year(s),Female,"Fatigue, Pain, Sluggishness, Vision blurred",Disability
9/30/2022,2022-CFS-014635,4/14/2022,CONCOMITANT,Mag,54,Vit/Min/Prot/Unconv Diet(Human/Animal),40.00,year(s),Female,"Fatigue, Pain, Sluggishness, Vision blurred",Disability
9/30/2022,2022-CFS-014635,4/14/2022,CONCOMITANT,vitamin c &d,54,Vit/Min/Prot/Unconv Diet(Human/Animal),40.00,year(s),Female,"Fatigue, Pain, Sluggishness, Vision blurred",Disability
9/30/2022,2022-CFS-014635,4/14/2022,CONCOMITANT,zinc,54,Vit/Min/Prot/Unconv Diet(Human/Animal),40.00,year(s),Female,"Fatigue, Pain, Sluggishness, Vision blurred",Disability
9/30/2022,2022-CFS-014634,9/29/2022,SUSPECT,NEWMANS OWN THIN AND CRISPY PIZZA UNCURED PEPPERONI,37,Mult Food Dinner/Grav/Sauce/Special,25.90,year(s),Female,"Abdominal pain upper, Diarrhoea, Vomiting",Other Serious or Important Medical Event
9/30/2022,2022-CFS-014599,9/22/2022,SUSPECT,FLAGSTONE FOODS PRALINE PECANS,23,Nuts/Edible Seed,,,Male,Chemical burn,Other Serious or Important Medical Event
9/30/2022,2022-CFS-014598,9/29/2022,SUSPECT,GENERAL MILLS HONEY NUT CHEERIOS,05,Cereal Prep/Breakfast Food,23.70,year(s),Male,"Abdominal pain upper, Nausea, Vomiting",Other Serious or Important Medical Event
9/30/2022,2022-CFS-014598,9/29/2022,CONCOMITANT,DAILY MULTIVITAMIN,54,Vit/Min/Prot/Unconv Diet(Human/Animal),23.70,year(s),Male,"Abdominal pain upper, Nausea, Vomiting",Other Serious or Important Medical Event
9/30/2022,2022-CFS-014597,9/27/2022,SUSPECT,GO RAW SPOUTED ORGANIC PUMPKIN SEEDS,23,Nuts/Edible Seed,56.00,year(s),Female,"Abdominal discomfort, Diarrhoea",Other Serious or Important Medical Event
9/30/2022,2022-CFS-014596,9/6/2022,SUSPECT,RITUAL SYNBIOTIC,54,Vit/Min/Prot/Unconv Diet(Human/Animal),35.00,year(s),Female,Hypersensitivity,"Hospitalization, Allergic Reaction"
9/29/2022,2022-CFS-015014,,SUSPECT,GERBER GOOD START GENTLE PRO POWDER,40P,Powder Formula,,,,"Diarrhoea, Pyrexia, Salmonellosis, Vomiting","Hospitalization, Other Serious or Important Medical Event, Visited a Health Care Provider"
9/29/2022,2022-CFS-014747,,SUSPECT,EXEMPTION 4,53,Cosmetics,,,,"Cerebral fungal infection, Death, Fungal infection",Death
9/29/2022,2022-CFS-014619,9/3/2022,SUSPECT,EXEMPTION 4,54,Vit/Min/Prot/Unconv Diet(Human/Animal),58.00,year(s),Female,"Arthralgia, Gait disturbance","Hospitalization, Other Serious or Important Medical Event, Visited a Health Care Provider"
9/29/2022,2022-CFS-014619,9/3/2022,SUSPECT,EXEMPTION 4,54,Vit/Min/Prot/Unconv Diet(Human/Animal),58.00,year(s),Female,"Arthralgia, Gait disturbance","Hospitalization, Other Serious or Important Medical Event, Visited a Health Care Provider"
9/29/2022,2022-CFS-014605,9/28/2022,SUSPECT,EXHALE WELLNESS DELTA-8 GUMMY CUBES,33,Candy W/O Choc/Special/Chew Gum,38.00,year(s),Male,"Chest pain, Dizziness, Loss of consciousness","Hospitalization, Other Serious or Important Medical Event, Visited Emergency Room"
9/29/2022,2022-CFS-014605,9/28/2022,CONCOMITANT,FISH OIL,54,Vit/Min/Prot/Unconv Diet(Human/Animal),38.00,year(s),Male,"Chest pain, Dizziness, Loss of consciousness","Hospitalization, Other Serious or Important Medical Event, Visited Emergency Room"
9/29/2022,2022-CFS-014605,9/28/2022,CONCOMITANT,MULTIVITAMINS,54,Vit/Min/Prot/Unconv Diet(Human/Animal),38.00,year(s),Male,"Chest pain, Dizziness, Loss of consciousness","Hospitalization, Other Serious or Important Medical Event, Visited Emergency Room"
9/29/2022,2022-CFS-014605,9/28/2022,CONCOMITANT,TUMERIC,54,Vit/Min/Prot/Unconv Diet(Human/Animal),38.00,year(s),Male,"Chest pain, Dizziness, Loss of consciousness","Hospitalization, Other Serious or Important Medical Event, Visited Emergency Room"
9/29/2022,2022-CFS-014605,9/28/2022,CONCOMITANT,VITAMIN B,54,Vit/Min/Prot/Unconv Diet(Human/Animal),38.00,year(s),Male,"Chest pain, Dizziness, Loss of consciousness","Hospitalization, Other Serious or Important Medical Event, Visited Emergency Room"
9/29/2022,2022-CFS-014605,9/28/2022,CONCOMITANT,VITAMIN C,54,Vit/Min/Prot/Unconv Diet(Human/Animal),38.00,year(s),Male,"Chest pain, Dizziness, Loss of consciousness","Hospitalization, Other Serious or Important Medical Event, Visited Emergency Room"
9/29/2022,2022-CFS-014605,9/28/2022,CONCOMITANT,VITAMIN E,54,Vit/Min/Prot/Unconv Diet(Human/Animal),38.00,year(s),Male,"Chest pain, Dizziness, Loss of consciousness","Hospitalization, Other Serious or Important Medical Event, Visited Emergency Room"
9/29/2022,2022-CFS-014605,9/28/2022,CONCOMITANT,ZINC,54,Vit/Min/Prot/Unconv Diet(Human/Animal),38.00,year(s),Male,"Chest pain, Dizziness, Loss of consciousness","Hospitalization, Other Serious or Important Medical Event, Visited Emergency Room"
9/29/2022,2022-CFS-014605,9/28/2022,CONCOMITANT,resveratrol,54,Vit/Min/Prot/Unconv Diet(Human/Animal),38.00,year(s),Male,"Chest pain, Dizziness, Loss of consciousness","Hospitalization, Other Serious or Important Medical Event, Visited Emergency Room"
9/29/2022,2022-CFS-014604,9/14/2022,SUSPECT,THC EDIBLE GUMMY,33,Candy W/O Choc/Special/Chew Gum,17.00,year(s),Male,Overdose,"Hospitalization, Other Serious or Important Medical Event, Visited Emergency Room"
9/29/2022,2022-CFS-014602,9/24/2022,SUSPECT,ENFAMIL PROSOBEE SIMPLY PLANT-BASED ,40P,Powder Formula,10.00,week(s),Male,"Diarrhoea, Salmonellosis, Vomiting","Hospitalization, Other Serious or Important Medical Event"
9/29/2022,2022-CFS-014586,,SUSPECT, AMERICAN CHEESE SINGLES,12,Cheese/Cheese Prod,,,Female,"Diarrhoea, Malaise",Other Outcome
9/29/2022,2022-CFS-014560,9/16/2022,SUSPECT,EXEMPTION 4,03,Bakery Prod/Dough/Mix/Icing,,,,"Burning sensation, Feeling hot, Swelling face, Swollen tongue, Throat tightness, Urticaria",Life Threatening
9/29/2022,2022-CFS-014550,1/3/2022,SUSPECT,KBLI BRAZIL SEED,54,Vit/Min/Prot/Unconv Diet(Human/Animal),35.00,year(s),Female,"Arthralgia, Heavy menstrual bleeding, Pain","Life Threatening, Other Serious or Important Medical Event, Other Serious Outcome"
9/29/2022,2022-CFS-014545,9/9/2022,SUSPECT,SIMILAC PROBIOTIC TRIBLEND,54,Vit/Min/Prot/Unconv Diet(Human/Animal),19.00,day(s),,"Meningitis cronobacter, Seizure",Hospitalization
9/29/2022,2022-CFS-014541,9/9/2022,SUSPECT,HERBALIFE HERBAL ALOE CONCENTRATE,41,Dietary Conventional Foods/Meal Replacements,,,Female,"Anaphylactic shock, Dyspnoea, Swelling",Hospitalization
9/29/2022,2022-CFS-014541,9/9/2022,SUSPECT,HERBALIFE IMMUNITY ESSENTIALS,54,Vit/Min/Prot/Unconv Diet(Human/Animal),,,Female,"Anaphylactic shock, Dyspnoea, Swelling",Hospitalization
9/29/2022,2022-CFS-014541,9/9/2022,SUSPECT,HERBALIFE NUTRITON FORMULA 1 HEALTHY MEAL,41,Dietary Conventional Foods/Meal Replacements,,,Female,"Anaphylactic shock, Dyspnoea, Swelling",Hospitalization
9/29/2022,2022-CFS-014541,9/9/2022,SUSPECT,HERBALIFE NUTRITON PROTEIN DRINK MIX,41,Dietary Conventional Foods/Meal Replacements,,,Female,"Anaphylactic shock, Dyspnoea, Swelling",Hospitalization
9/29/2022,2022-CFS-014541,9/9/2022,SUSPECT,HERBALIFE PROLESSA DUO,54,Vit/Min/Prot/Unconv Diet(Human/Animal),,,Female,"Anaphylactic shock, Dyspnoea, Swelling",Hospitalization
9/29/2022,2022-CFS-014541,9/9/2022,SUSPECT,HERBALIFE SKIN COLLAGEN BEAUTY BOOSTER,54,Vit/Min/Prot/Unconv Diet(Human/Animal),,,Female,"Anaphylactic shock, Dyspnoea, Swelling",Hospitalization
9/29/2022,2022-CFS-014541,9/9/2022,CONCOMITANT,Dry Flavoring Syrup Mix Sugar Free (Chocolate Creme Cookie Flavor),41,Dietary Conventional Foods/Meal Replacements,,,Female,"Anaphylactic shock, Dyspnoea, Swelling",Hospitalization
9/29/2022,2022-CFS-014541,9/9/2022,CONCOMITANT,Formula 1 Healthy Meal Nutritional Shake Mix (Cookies and Cream Flavor) ,41,Dietary Conventional Foods/Meal Replacements,,,Female,"Anaphylactic shock, Dyspnoea, Swelling",Hospitalization
9/29/2022,2022-CFS-014541,9/9/2022,CONCOMITANT,Herbal Aloe Concentrate (Man41go Flavor),54,Vit/Min/Prot/Unconv Diet(Human/Animal),,,Female,"Anaphylactic shock, Dyspnoea, Swelling",Hospitalization
9/29/2022,2022-CFS-014541,9/9/2022,CONCOMITANT,Protein Drink Mix (Chocolate Flavor),41,Dietary Conventional Foods/Meal Replacements,,,Female,"Anaphylactic shock, Dyspnoea, Swelling",Hospitalization
9/29/2022,2022-CFS-014541,9/9/2022,CONCOMITANT,Skin Collagen Beauty Booster,54,Vit/Min/Prot/Unconv Diet(Human/Animal),,,Female,"Anaphylactic shock, Dyspnoea, Swelling",Hospitalization
9/29/2022,2022-CFS-014531,9/20/2022,SUSPECT,CENTRUM SILVER MENS 50+,54,Vit/Min/Prot/Unconv Diet(Human/Animal),,,,Foreign body,Other Serious or Important Medical Event
9/29/2022,2022-CFS-014525,,SUSPECT,CITRACAL PETITES,54,Vit/Min/Prot/Unconv Diet(Human/Animal),,,,Choking,"Other Serious or Important Medical Event, Other Serious Outcome"
9/28/2022,2022-CFS-015036,,SUSPECT,KELLOGG'S FROSTED FLAKES CEREAL,05,Cereal Prep/Breakfast Food,16.00,year(s),Female,"Headache, Nausea","Hospitalization, Other Serious or Important Medical Event, Visited Emergency Room"
9/28/2022,2022-CFS-014590,,SUSPECT,GOOD & GATHER 90 SECOND SPANISH TYLE RICE WITH TOMATOES AND PEPPERS,02,Whole Grain/Milled Grain Prod/Starch,,,Male,Thermal burn,Other Outcome
9/28/2022,2022-CFS-014539,7/15/2022,SUSPECT,GREAT VALUE SHREDDED HASH BROWNS,25,Vegetables/Vegetable Products,50.10,year(s),Male,Malaise,"Hospitalization, Visited Emergency Room"
9/28/2022,2022-CFS-014538,9/26/2022,SUSPECT,DASANI PURIFIED WATER,29,Soft Drink/Water,53.00,year(s),Female,Incontinence,Other Serious or Important Medical Event
9/28/2022,2022-CFS-014537,8/5/2022,SUSPECT,HUNGRY MAN SELECT,37,Mult Food Dinner/Grav/Sauce/Special,45.00,year(s),Male,"Contusion, Mouth haemorrhage, Mouth injury",Other Serious or Important Medical Event
9/28/2022,2022-CFS-014536,3/25/2022,SUSPECT,ARTRI AJO KING,54,Vit/Min/Prot/Unconv Diet(Human/Animal),85.00,year(s),Female,Death,"Death, Hospitalization, Disability, Visited a Health Care Provider"
9/28/2022,2022-CFS-014470,,SUSPECT,CITRACAL MAXIMUM BAYER,54,Vit/Min/Prot/Unconv Diet(Human/Animal),,,,Choking,Other Serious or Important Medical Event
9/27/2022,2022-CFS-014483,6/4/2022,SUSPECT,SOYLENT READY TO DRINK MEAL STRAWBERRY FLAVOR,41,Dietary Conventional Foods/Meal Replacements,34.00,year(s),Female,"Abdominal distension, Abdominal pain, Faecaloma, Flatulence, Vomiting","Other Serious or Important Medical Event, Visited a Health Care Provider"
9/27/2022,2022-CFS-014482,9/24/2022,SUSPECT,BRAZILIAN SUPER NUTRIENT COMPLEX AND A PROPRIETARY POLYMER SYSTEM,53,Cosmetics,74.00,year(s),Female,"Pruritus, Rash, Urticaria",Visited a Health Care Provider
9/27/2022,2022-CFS-014481,9/27/2022,SUSPECT,NATURIPE BLUEBERRIES,20,Fruit/Fruit Prod,54.00,year(s),Female,"Diarrhoea, Malaise, Vomiting",Other Serious or Important Medical Event
9/27/2022,2022-CFS-014481,9/27/2022,CONCOMITANT,Multivitamin,54,Vit/Min/Prot/Unconv Diet(Human/Animal),54.00,year(s),Female,"Diarrhoea, Malaise, Vomiting",Other Serious or Important Medical Event
9/27/2022,2022-CFS-014451,,SUSPECT,ZAZA RED,54,Vit/Min/Prot/Unconv Diet(Human/Animal),,,Female,"Dependence, Diarrhoea, Irritability, Seizure, Tremor, Vomiting","Life Threatening, Disability, Other Serious Outcome"
9/27/2022,2022-CFS-014430,,SUSPECT,ARBONNE BEWELL SUPERFOOD GREENS,54,Vit/Min/Prot/Unconv Diet(Human/Animal),,,Female,Malaise,Hospitalization
9/27/2022,2022-CFS-014430,,SUSPECT,ARBONNE CLEANTOX GENTLE CLEANSE,54,Vit/Min/Prot/Unconv Diet(Human/Animal),,,Female,Malaise,Hospitalization
9/27/2022,2022-CFS-014430,,SUSPECT,ARBONNE CLEANTOX HERBAL DETOX TEA,54,Vit/Min/Prot/Unconv Diet(Human/Animal),,,Female,Malaise,Hospitalization
9/27/2022,2022-CFS-014430,,SUSPECT,ARBONNE FEELFIT PEA PROTEIN SHAKE CHOCOLATE FLAVOR,54,Vit/Min/Prot/Unconv Diet(Human/Animal),,,Female,Malaise,Hospitalization
9/27/2022,2022-CFS-014430,,SUSPECT,ARBONNE FEELFIT PEA PROTEIN SHAKE COFFEE FLAVOR,54,Vit/Min/Prot/Unconv Diet(Human/Animal),,,Female,Malaise,Hospitalization
9/27/2022,2022-CFS-014430,,SUSPECT,ARBONNE FEELFIT PEA PROTEIN SHAKE VANILLA FLAVOR,54,Vit/Min/Prot/Unconv Diet(Human/Animal),,,Female,Malaise,Hospitalization
9/27/2022,2022-CFS-014430,,SUSPECT,ARBONNE GUTHEALTH DIGESTION AND MICROBIOME SUPPORT,54,Vit/Min/Prot/Unconv Diet(Human/Animal),,,Female,Malaise,Hospitalization
9/27/2022,2022-CFS-014430,,SUSPECT,ARBONNE GUTHEALTH PREBIOTIC FIBER,54,Vit/Min/Prot/Unconv Diet(Human/Animal),,,Female,Malaise,Hospitalization
9/27/2022,2022-CFS-014430,,SUSPECT,ARBONNE INNERCALM ADAPTOGENIC DESTRESS POWDERWITH ASHWAGANDHA AND SAFFRON,54,Vit/Min/Prot/Unconv Diet(Human/Animal),,,Female,Malaise,Hospitalization
9/27/2022,2022-CFS-014430,,SUSPECT,ARBONNE SECOND NATURE PRESSED POWDER DARK,54,Vit/Min/Prot/Unconv Diet(Human/Animal),,,Female,Malaise,Hospitalization
9/27/2022,2022-CFS-014428,9/8/2022,SUSPECT,NATURE MADE POTASSIUM GLUCONATE,54,Vit/Min/Prot/Unconv Diet(Human/Animal),53.00,year(s),Female,Choking,Other Serious or Important Medical Event
9/27/2022,2022-CFS-014428,9/8/2022,CONCOMITANT,CALCIUM,54,Vit/Min/Prot/Unconv Diet(Human/Animal),53.00,year(s),Female,Choking,Other Serious or Important Medical Event
9/27/2022,2022-CFS-014428,9/8/2022,CONCOMITANT,OMEGA 3,54,Vit/Min/Prot/Unconv Diet(Human/Animal),53.00,year(s),Female,Choking,Other Serious or Important Medical Event
9/27/2022,2022-CFS-014428,9/8/2022,CONCOMITANT,VITAMIN D,54,Vit/Min/Prot/Unconv Diet(Human/Animal),53.00,year(s),Female,Choking,Other Serious or Important Medical Event
9/27/2022,2022-CFS-014427,5/10/2020,SUSPECT,VITAPEARL,54,Vit/Min/Prot/Unconv Diet(Human/Animal),45.00,year(s),Female,"Abortion spontaneous, Adrenal disorder, Asthenia, Blood folate increased, Mitochondrial cytopathy","Other Serious or Important Medical Event, Visited a Health Care Provider"
9/27/2022,2022-CFS-014426,8/24/2022,SUSPECT,PRESERVISION AREDS 2,54,Vit/Min/Prot/Unconv Diet(Human/Animal),89.00,year(s),Female,Death,Death
9/27/2022,2022-CFS-014420,6/16/2022,SUSPECT,PRESERVISION AREDS 2,54,Vit/Min/Prot/Unconv Diet(Human/Animal),83.00,year(s),Male,"Eye pruritus, Muscle twitching, Skin exfoliation",Other Serious or Important Medical Event
9/27/2022,2022-CFS-014416,9/11/2022,SUSPECT,PRESERVISION AREDS 2,54,Vit/Min/Prot/Unconv Diet(Human/Animal),,,Female,"Choking, Foreign body",Other Serious or Important Medical Event
9/27/2022,2022-CFS-014413,8/1/2022,SUSPECT,PRESERVISION AREDS 2,54,Vit/Min/Prot/Unconv Diet(Human/Animal),80.00,year(s),Female,"Heart rate increased, Palpitations",Hospitalization
9/27/2022,2022-CFS-014412,9/26/2022,SUSPECT,CREATINE MONOHYDRATE,54,Vit/Min/Prot/Unconv Diet(Human/Animal),26.00,year(s),Male,"Muscle spasms, Muscle twitching",Other Serious or Important Medical Event
9/27/2022,2022-CFS-014411,1/1/2022,SUSPECT,PRESERVISION AREDS,54,Vit/Min/Prot/Unconv Diet(Human/Animal),83.00,year(s),Female,"Diarrhoea, Haematochezia",Other Serious or Important Medical Event
9/27/2022,2022-CFS-014410,8/31/2022,SUSPECT,OCUVITE ADULT 50 PLUS,54,Vit/Min/Prot/Unconv Diet(Human/Animal),65.00,year(s),Male,Glaucoma,Other Serious or Important Medical Event
9/27/2022,2022-CFS-014410,8/31/2022,CONCOMITANT,MULTIVITAMIN,54,Vit/Min/Prot/Unconv Diet(Human/Animal),65.00,year(s),Male,Glaucoma,Other Serious or Important Medical Event
9/27/2022,2022-CFS-014409,,SUSPECT,PRESERVISION AREDS 2,54,Vit/Min/Prot/Unconv Diet(Human/Animal),,,Female,Death,Death
9/27/2022,2022-CFS-014408,,SUSPECT,ARBONNE BEWELL SUPERFOOD GREENS,54,Vit/Min/Prot/Unconv Diet(Human/Animal),,,Female,Hypersensitivity,"Hospitalization, Allergic Reaction"
9/27/2022,2022-CFS-014408,,SUSPECT,ARBONNE CLEANTOX GENTLE CLEANSE,54,Vit/Min/Prot/Unconv Diet(Human/Animal),,,Female,Hypersensitivity,"Hospitalization, Allergic Reaction"
9/27/2022,2022-CFS-014408,,SUSPECT,ARBONNE CLEANTOX HERBAL DETOX TEA,54,Vit/Min/Prot/Unconv Diet(Human/Animal),,,Female,Hypersensitivity,"Hospitalization, Allergic Reaction"
9/27/2022,2022-CFS-014408,,SUSPECT,ARBONNE ENERGYFIZZ GINSENG FIZZ STICKS,54,Vit/Min/Prot/Unconv Diet(Human/Animal),,,Female,Hypersensitivity,"Hospitalization, Allergic Reaction"
9/27/2022,2022-CFS-014408,,SUSPECT,ARBONNE ENERGYFIZZ GINSENG FIZZ STICKS MANGO PEACH FLAVOR,54,Vit/Min/Prot/Unconv Diet(Human/Animal),,,Female,Hypersensitivity,"Hospitalization, Allergic Reaction"
9/27/2022,2022-CFS-014408,,SUSPECT,ARBONNE FEELFIT PEA PROTEIN SHAKE,54,Vit/Min/Prot/Unconv Diet(Human/Animal),,,Female,Hypersensitivity,"Hospitalization, Allergic Reaction"
9/27/2022,2022-CFS-014408,,SUSPECT,ARBONNE FEELFIT PEA PROTEIN SHAKE,54,Vit/Min/Prot/Unconv Diet(Human/Animal),,,Female,Hypersensitivity,"Hospitalization, Allergic Reaction"
9/27/2022,2022-CFS-014408,,SUSPECT,ARBONNE GUTHEALTH DIGESTION AND MICROBIOME SUPPORT,54,Vit/Min/Prot/Unconv Diet(Human/Animal),,,Female,Hypersensitivity,"Hospitalization, Allergic Reaction"
9/27/2022,2022-CFS-014407,,SUSPECT,EQUELLE,54,Vit/Min/Prot/Unconv Diet(Human/Animal),,,Female,"Hypersensitivity, Throat tightness","Other Serious or Important Medical Event, Allergic Reaction"
9/27/2022,2022-CFS-014406,,SUSPECT,MELATONIN,54,Vit/Min/Prot/Unconv Diet(Human/Animal),18.00,month(s),,"Exposure via breast milk, Haemorrhage, Platelet aggregation decreased","Other Serious or Important Medical Event, Visited a Health Care Provider"
9/27/2022,2022-CFS-014405,,SUSPECT,ONE A DAY WOMEN'S 50 PLUS HEALTHY ADVANTAGE,54,Vit/Min/Prot/Unconv Diet(Human/Animal),,,Female,Foreign body in throat,Other Serious or Important Medical Event
9/27/2022,2022-CFS-014404,,SUSPECT,VITAFUSION MEN'S COMPLETE MULTIVITAMIN GUMMY VITAMINS,54,Vit/Min/Prot/Unconv Diet(Human/Animal),,,Male,"Chest discomfort, Dyspnoea, Fatigue","Hospitalization, Other Serious or Important Medical Event, Visited Emergency Room, Other Serious Outcome"
9/27/2022,2022-CFS-014403,,SUSPECT,OSTEO BI-FLEX JOINT HEALTH TRIPLE STRENGTH + MSM FORMULA 2 PER DAY COATED TABLETS,54,Vit/Min/Prot/Unconv Diet(Human/Animal),,,Male,"Choking, Dysphagia",Other Serious Outcome
9/26/2022,2022-CFS-014436,9/26/2022,SUSPECT,LUCKY CHARMS,05,Cereal Prep/Breakfast Food,,,Male,"Malaise, Vomiting",Other Serious or Important Medical Event
9/26/2022,2022-CFS-014433,9/21/2022,SUSPECT,ARTRI KING,54,Vit/Min/Prot/Unconv Diet(Human/Animal),65.00,year(s),Female,"Blood glucose increased, Blood pressure increased",Other Serious or Important Medical Event
9/26/2022,2022-CFS-014425,9/24/2022,SUSPECT,DAVES KILLER BREAD THIN SLICED BREAD,03,Bakery Prod/Dough/Mix/Icing,,,Unknown,"Oropharyngeal pain, Vomiting",Other Serious or Important Medical Event
9/26/2022,2022-CFS-014424,9/26/2022,SUSPECT,NATURDAO DIETARY SUPPLEMENT,54,Vit/Min/Prot/Unconv Diet(Human/Animal),58.00,year(s),Female,Sedation,Disability
9/26/2022,2022-CFS-014424,9/26/2022,CONCOMITANT,vitamin b12,54,Vit/Min/Prot/Unconv Diet(Human/Animal),58.00,year(s),Female,Sedation,Disability
9/26/2022,2022-CFS-014423,8/20/2022,SUSPECT,CBD GUMMIES,33,Candy W/O Choc/Special/Chew Gum,53.00,year(s),Male,"Choking, Lethargy",Other Serious or Important Medical Event
9/26/2022,2022-CFS-014419,8/20/2022,SUSPECT,CBD BROWNIE,03,Bakery Prod/Dough/Mix/Icing,59.00,year(s),Female,Seizure,Other Serious or Important Medical Event
9/26/2022,2022-CFS-014418,9/26/2022,SUSPECT,LUCKY CHARMS,05,Cereal Prep/Breakfast Food,40.00,year(s),Male,"Abdominal pain upper, Diarrhoea, Faeces discoloured, Faeces soft",Other Serious or Important Medical Event
9/26/2022,2022-CFS-014417,9/19/2022,SUSPECT,GIM JABAN SEASONED SEAWEED SNACK,07,Snack Food Item,43.00,year(s),Female,Poisoning,Other Serious or Important Medical Event
9/26/2022,2022-CFS-014415,9/6/2022,SUSPECT,TRADER JOES RAW ALMOND BUTTER CRUNCHY,23,Nuts/Edible Seed,35.00,year(s),Male,"Abdominal pain upper, Migraine",Disability
9/26/2022,2022-CFS-014414,9/26/2022,SUSPECT,SARGENTO BALANCE BREAKS,12,Cheese/Cheese Prod,63.00,year(s),Female,Hypersensitivity,Other Serious or Important Medical Event
9/26/2022,2022-CFS-014402,,SUSPECT,COUNTRY LIFE REALFOOD ORGANICS PRENATAL,54,Vit/Min/Prot/Unconv Diet(Human/Animal),,,Female,Gluten sensitivity,Other Serious Outcome
9/26/2022,2022-CFS-014401,9/21/2022,SUSPECT,EXTENZE PLUS,54,Vit/Min/Prot/Unconv Diet(Human/Animal),78.00,year(s),Male,"Headache, Myocardial injury, Pollakiuria, Prostatic specific antigen increased, Pyrexia, Tremor","Hospitalization, Visited a Health Care Provider"
9/26/2022,2022-CFS-014401,9/21/2022,CONCOMITANT,Fish oil,54,Vit/Min/Prot/Unconv Diet(Human/Animal),78.00,year(s),Male,"Headache, Myocardial injury, Pollakiuria, Prostatic specific antigen increased, Pyrexia, Tremor","Hospitalization, Visited a Health Care Provider"
9/26/2022,2022-CFS-014401,9/21/2022,CONCOMITANT,multivitamin,54,Vit/Min/Prot/Unconv Diet(Human/Animal),78.00,year(s),Male,"Headache, Myocardial injury, Pollakiuria, Prostatic specific antigen increased, Pyrexia, Tremor","Hospitalization, Visited a Health Care Provider"
9/26/2022,2022-CFS-014400,,SUSPECT,CITRACAL PETITES,54,Vit/Min/Prot/Unconv Diet(Human/Animal),,,,"Choking, Vomiting","Other Serious or Important Medical Event, Other Serious Outcome"
9/26/2022,2022-CFS-014399,,SUSPECT,CITRACAL PETITES,54,Vit/Min/Prot/Unconv Diet(Human/Animal),72.00,year(s),Female,"Foreign body in throat, Sensation of foreign body","Other Serious or Important Medical Event, Other Serious Outcome"
9/26/2022,2022-CFS-014398,9/20/2022,SUSPECT,CENTRUM SILVER,54,Vit/Min/Prot/Unconv Diet(Human/Animal),53.00,year(s),Female,"Chills, Headache, Pain, Taste disorder",Other Serious or Important Medical Event
9/26/2022,2022-CFS-014397,9/25/2022,SUSPECT,C4 ENERGY,29,Soft Drink/Water,,,,Paraesthesia,Other Serious or Important Medical Event
9/26/2022,2022-CFS-014394,9/25/2022,SUSPECT,DIET PEPSI,29,Soft Drink/Water,34.00,year(s),Male,Nausea,Other Serious or Important Medical Event
9/26/2022,2022-CFS-014393,3/15/2022,SUSPECT,ARIANA GRANDE CLOUD EAU DE PARFUM SPRAY,53,Cosmetics,34.30,year(s),Female,"Feeling abnormal, Headache",Other Outcome
9/26/2022,2022-CFS-014393,3/15/2022,CONCOMITANT,B12 supplement,54,Vit/Min/Prot/Unconv Diet(Human/Animal),34.30,year(s),Female,"Feeling abnormal, Headache",Other Outcome
9/26/2022,2022-CFS-014393,3/15/2022,CONCOMITANT,lymphdrainex drops,54,Vit/Min/Prot/Unconv Diet(Human/Animal),34.30,year(s),Female,"Feeling abnormal, Headache",Other Outcome
9/26/2022,2022-CFS-014393,3/15/2022,CONCOMITANT,slow release ferrous sulfate,54,Vit/Min/Prot/Unconv Diet(Human/Animal),34.30,year(s),Female,"Feeling abnormal, Headache",Other Outcome
9/26/2022,2022-CFS-014393,3/15/2022,CONCOMITANT,vitamin C,54,Vit/Min/Prot/Unconv Diet(Human/Animal),34.30,year(s),Female,"Feeling abnormal, Headache",Other Outcome
9/26/2022,2022-CFS-014392,9/24/2022,SUSPECT,CINNAMON TOASTED CRUNCH CEREAL BARS HEMP DERIVED DELTA 8,07,Snack Food Item,39.00,year(s),Female,"Dyspnoea, Tachycardia, Tremor","Hospitalization, Visited Emergency Room"
9/26/2022,2022-CFS-014391,9/3/2022,SUSPECT,OGX QUENCHING COCONUT CURLS CONDITIONER WITH COCONUT OIL CITRUS OIL AND,53,Cosmetics,40.00,year(s),Female,Alopecia,Other Outcome
9/26/2022,2022-CFS-014391,9/3/2022,SUSPECT,OGX QUENCHING COCONUT CURLS SHAMPOO,53,Cosmetics,40.00,year(s),Female,Alopecia,Other Outcome
9/26/2022,2022-CFS-014391,9/3/2022,CONCOMITANT,Womens daily rainbow multivitamin,54,Vit/Min/Prot/Unconv Diet(Human/Animal),40.00,year(s),Female,Alopecia,Other Outcome