﻿CAERS_CREATED_DATE,REPORT_ID,DATE_EVENT,PRODUCT_TYPE,PRODUCT,PRODUCT_CODE,DESCRIPTION,PATIENT_AGE,AGE_UNITS,SEX,CASE_MEDDRA_PREFERRED_TERMS,CASE_OUTCOME
1/1/2004,65325,8/4/2003,SUSPECT,MIDWEST COUNTRY FAIR CHOCOLATE FLAVORED CHIPS,3,Bakery Prod/Dough/Mix/Icing,2.0,year(s),Female,"COUGH, DYSPNOEA, HOSPITALISATION, RASH, SWELLING FACE, WHEEZING","Hospitalization, Required Intervention, Visited Emergency Room, Visited a Health Care Provider"
1/1/2004,65327,11/2/2003,SUSPECT,POST HONEYCOMB STRAWBERRY BLASTED,5,Cereal Prep/Breakfast Food,,,Male,Mouth injury,Other Outcome
1/1/2004,65333,,SUSPECT,KROGER CLASSIC CREAM-DE-MINT CANDY MINT CHIP ICE CREAM,13,Ice Cream Prod,,,Female,"DIARRHOEA, DYSGEUSIA, NAUSEA",Visited Emergency Room
1/1/2004,65335,11/24/2003,SUSPECT,ENFAMIL LIPIL BABY FORMULA,40,Baby Food Products,3.0,month(s),,"Gastrointestinal disorder, Vomiting",Other Serious or Important Medical Event
1/1/2004,65336,,SUSPECT,ENFIMIL LIPIL BABY FORMULA,40,Baby Food Products,,,,"GASTROINTESTINAL DISORDER, PHYSICAL EXAMINATION",Visited a Health Care Provider
1/1/2004,65345,12/21/2003,SUSPECT,"FRITO LAY FUNYUNS ONION FLAVOR, ONION RINGS",7,Snack Food Item,10.0,year(s),Male,CHOKING,Other Outcome
1/1/2004,65350,,SUSPECT,GRAPE,20,Fruit/Fruit Prod,,,,"Choking, Death",Death
1/2/2004,65353,12/1/2003,SUSPECT,HERBALIFE RELAX NOW,54,Vit/Min/Prot/Unconv Diet(Human/Animal),39.5,year(s),Female,"DELUSION, PARANOIA, PHYSICAL EXAMINATION",Visited a Health Care Provider
1/2/2004,65353,12/1/2003,SUSPECT,HERBALIFE TOTAL CONTROL,54,Vit/Min/Prot/Unconv Diet(Human/Animal),39.5,year(s),Female,"DELUSION, PARANOIA, PHYSICAL EXAMINATION",Visited a Health Care Provider
1/2/2004,65354,,SUSPECT,YOHIMBE,54,Vit/Min/Prot/Unconv Diet(Human/Animal),66.0,year(s),Male,BLOOD PRESSURE INCREASED,Required Intervention
1/2/2004,65355,10/27/2003,SUSPECT,CAL-C PEACH TROPIC ENRICHED BEVERAGE BLEND,29,Soft Drink/Water,,,Male,"ABDOMINAL PAIN, DIARRHOEA, FAECES PALE, FLUSHING, LOOSE STOOLS, MALAISE, OROPHARYNGEAL SWELLING, PHYSICAL EXAMINATION, RASH, VOMITING",Other Outcome
1/2/2004,65356,10/27/2003,SUSPECT,CAL-C PEACH TROPIC ENRICHED BEVERAGE BLEND,29,Soft Drink/Water,,,,"ABDOMINAL PAIN, ABDOMINAL PAIN UPPER, LOOSE STOOLS, RASH, VOMITING",Other Outcome
1/2/2004,65357,10/27/2003,SUSPECT,CAL-C PEACH TROPIC ENRICHED BEVERAGE BLEND,29,Soft Drink/Water,,,,"ABDOMINAL PAIN, ABDOMINAL PAIN UPPER, DIARRHOEA, LOOSE STOOLS, MALAISE, RASH, VOMITING",Other Outcome
1/3/2004,65379,11/5/2003,SUSPECT,I CONTACT LIP-INK (SEMI-PERMANENT),53,Cosmetics,,,Female,"PARAESTHESIA ORAL, SWELLING FACE",Other Outcome
1/3/2004,65387,,SUSPECT,H.P. HOOD HALF AND HALF,9,Milk/Butter/Dried Milk Prod,,,Female,PHARYNGITIS,Other Outcome
1/3/2004,65388,12/30/2003,SUSPECT,LACTAID REDUCED FAT (2%) MILK; 100% LACTOSE FREE,9,Milk/Butter/Dried Milk Prod,,,Male,VOMITING,Other Outcome
1/5/2004,65399,11/22/2003,SUSPECT,METOBOLITE 356,54,Vit/Min/Prot/Unconv Diet(Human/Animal),51.0,year(s),Male,"Completed suicide, Death, Stress",Death
1/5/2004,65400,9/5/2001,SUSPECT,METABOLIFE,54,Vit/Min/Prot/Unconv Diet(Human/Animal),45.0,year(s),Female,"Death, Mitral valve disease","Death, Visited a Health Care Provider"
1/5/2004,65403,3/4/2003,SUSPECT,METABOLIFE METABOLIFE,54,Vit/Min/Prot/Unconv Diet(Human/Animal),54.0,year(s),Female,CEREBROVASCULAR ACCIDENT,"Life Threatening, Hospitalization, Visited Emergency Room, Visited a Health Care Provider"
1/5/2004,65404,,SUSPECT,ENIVA MINERALS FOR LIFE-SILVER,54,Vit/Min/Prot/Unconv Diet(Human/Animal),16.0,year(s),Male,"MUCOSAL DISCOLOURATION, SKIN DISCOLOURATION",Visited a Health Care Provider
1/6/2004,65416,11/15/2003,SUSPECT,AVLIMIL,54,Vit/Min/Prot/Unconv Diet(Human/Animal),36.0,year(s),Female,"BLOOD PRESSURE INCREASED, DIZZINESS, HEART RATE INCREASED, PALPITATIONS",Visited a Health Care Provider
1/6/2004,65418,,SUSPECT,HANNAFORD'S CENTRAL-VITE,54,Vit/Min/Prot/Unconv Diet(Human/Animal),79.0,year(s),Female,"Faecal incontinence, Urinary incontinence","Life Threatening, Required Intervention, Disability"
1/6/2004,65419,,SUSPECT,AVLIMIL,54,Vit/Min/Prot/Unconv Diet(Human/Animal),48.0,year(s),Female,PAIN IN EXTREMITY,Other Outcome
1/6/2004,65420,11/1/2003,SUSPECT,COFFEE,31,Coffee/Tea,33.0,year(s),Male,"CHEST PAIN, DIZZINESS, EXTRASYSTOLES, HOSPITALISATION, ORTHOSTATIC HYPOTENSION, PALPITATIONS, PARAESTHESIA, PHYSICAL EXAMINATION, VENTRICULAR EXTRASYSTOLES","Life Threatening, Hospitalization, Disability"
1/6/2004,65420,11/1/2003,SUSPECT,DIET CAFFEINE FREE COKE,29,Soft Drink/Water,33.0,year(s),Male,"CHEST PAIN, DIZZINESS, EXTRASYSTOLES, HOSPITALISATION, ORTHOSTATIC HYPOTENSION, PALPITATIONS, PARAESTHESIA, PHYSICAL EXAMINATION, VENTRICULAR EXTRASYSTOLES","Life Threatening, Hospitalization, Disability"
1/6/2004,65420,11/1/2003,SUSPECT,DIET COKE,29,Soft Drink/Water,33.0,year(s),Male,"CHEST PAIN, DIZZINESS, EXTRASYSTOLES, HOSPITALISATION, ORTHOSTATIC HYPOTENSION, PALPITATIONS, PARAESTHESIA, PHYSICAL EXAMINATION, VENTRICULAR EXTRASYSTOLES","Life Threatening, Hospitalization, Disability"
1/6/2004,65420,11/1/2003,SUSPECT,DIET PEPSI,29,Soft Drink/Water,33.0,year(s),Male,"CHEST PAIN, DIZZINESS, EXTRASYSTOLES, HOSPITALISATION, ORTHOSTATIC HYPOTENSION, PALPITATIONS, PARAESTHESIA, PHYSICAL EXAMINATION, VENTRICULAR EXTRASYSTOLES","Life Threatening, Hospitalization, Disability"
1/6/2004,65420,11/1/2003,SUSPECT,DIET SPRITE,29,Soft Drink/Water,33.0,year(s),Male,"CHEST PAIN, DIZZINESS, EXTRASYSTOLES, HOSPITALISATION, ORTHOSTATIC HYPOTENSION, PALPITATIONS, PARAESTHESIA, PHYSICAL EXAMINATION, VENTRICULAR EXTRASYSTOLES","Life Threatening, Hospitalization, Disability"
1/6/2004,65420,11/1/2003,SUSPECT,JAMS,22,Fruit/Fruit Prod,33.0,year(s),Male,"CHEST PAIN, DIZZINESS, EXTRASYSTOLES, HOSPITALISATION, ORTHOSTATIC HYPOTENSION, PALPITATIONS, PARAESTHESIA, PHYSICAL EXAMINATION, VENTRICULAR EXTRASYSTOLES","Life Threatening, Hospitalization, Disability"
1/6/2004,65420,11/1/2003,SUSPECT,LISTERINE STRIPS,53,Cosmetics,33.0,year(s),Male,"CHEST PAIN, DIZZINESS, EXTRASYSTOLES, HOSPITALISATION, ORTHOSTATIC HYPOTENSION, PALPITATIONS, PARAESTHESIA, PHYSICAL EXAMINATION, VENTRICULAR EXTRASYSTOLES","Life Threatening, Hospitalization, Disability"
1/6/2004,65420,11/1/2003,SUSPECT,NUTRASWEET,45,Food Additives (Human Use),33.0,year(s),Male,"CHEST PAIN, DIZZINESS, EXTRASYSTOLES, HOSPITALISATION, ORTHOSTATIC HYPOTENSION, PALPITATIONS, PARAESTHESIA, PHYSICAL EXAMINATION, VENTRICULAR EXTRASYSTOLES","Life Threatening, Hospitalization, Disability"
1/6/2004,65420,11/1/2003,SUSPECT,PUDDINGS,35,Gelatin/Rennet/Pudding Mix/Pie Filling,33.0,year(s),Male,"CHEST PAIN, DIZZINESS, EXTRASYSTOLES, HOSPITALISATION, ORTHOSTATIC HYPOTENSION, PALPITATIONS, PARAESTHESIA, PHYSICAL EXAMINATION, VENTRICULAR EXTRASYSTOLES","Life Threatening, Hospitalization, Disability"
1/6/2004,65420,11/1/2003,SUSPECT,TEA,31,Coffee/Tea,33.0,year(s),Male,"CHEST PAIN, DIZZINESS, EXTRASYSTOLES, HOSPITALISATION, ORTHOSTATIC HYPOTENSION, PALPITATIONS, PARAESTHESIA, PHYSICAL EXAMINATION, VENTRICULAR EXTRASYSTOLES","Life Threatening, Hospitalization, Disability"
1/6/2004,65421,8/21/2003,SUSPECT,DIET COKE,29,Soft Drink/Water,14.0,year(s),Male,ALOPECIA,Other Outcome
1/6/2004,65421,8/21/2003,SUSPECT,GATORADE SPORTS DRINK,29,Soft Drink/Water,14.0,year(s),Male,ALOPECIA,Other Outcome
1/6/2004,65421,8/21/2003,SUSPECT,TOOTHPASTE,53,Cosmetics,14.0,year(s),Male,ALOPECIA,Other Outcome
1/6/2004,65422,5/24/2003,SUSPECT,FLEXIUM SAM-E,54,Vit/Min/Prot/Unconv Diet(Human/Animal),59.0,year(s),Female,"ALOPECIA, ARTHRALGIA, DERMATOLOGIC EXAMINATION, HEADACHE, HYPERSENSITIVITY, HYPOTRICHOSIS, PHYSICAL EXAMINATION",Visited a Health Care Provider
1/6/2004,65423,1/1/1996,SUSPECT,BREATHE EASY TEA,54,Vit/Min/Prot/Unconv Diet(Human/Animal),37.5,year(s),Female,"HYPERVENTILATION, PALPITATIONS, PARANOIA, PSYCHOTIC DISORDER",Other Outcome
1/6/2004,65424,,SUSPECT,RIPPED FUEL,54,Vit/Min/Prot/Unconv Diet(Human/Animal),33.0,year(s),Female,"FACIAL PALSY, TREMOR","Required Intervention, Visited a Health Care Provider"
1/6/2004,65425,,SUSPECT,SIBERIAN GINSENG,54,Vit/Min/Prot/Unconv Diet(Human/Animal),29.0,year(s),Male,"BODY TEMPERATURE INCREASED, DIZZINESS",Visited a Health Care Provider
1/6/2004,65426,11/6/1998,SUSPECT,EPHEDRA,54,Vit/Min/Prot/Unconv Diet(Human/Animal),43.0,year(s),Male,"HOSPITALISATION, MYOCARDIAL INFARCTION","Life Threatening, Hospitalization, Disability"
1/6/2004,65427,,SUSPECT,METABOLIFE,54,Vit/Min/Prot/Unconv Diet(Human/Animal),27.0,year(s),Female,PERIPHERAL VASCULAR DISORDER,Visited a Health Care Provider
1/6/2004,65427,,SUSPECT,PRODUCTS CONTAINING EPHEDRA,54,Vit/Min/Prot/Unconv Diet(Human/Animal),27.0,year(s),Female,PERIPHERAL VASCULAR DISORDER,Visited a Health Care Provider
1/6/2004,65430,,SUSPECT,EPHEDRINE MULTI-ACTION,54,Vit/Min/Prot/Unconv Diet(Human/Animal),42.0,year(s),Male,"CHEST PAIN, COUGH",Other Outcome
1/6/2004,65431,,SUSPECT,STACKER 3 WITH CHITOSAN EPHEDRA FREE FORMULA,54,Vit/Min/Prot/Unconv Diet(Human/Animal),40.0,year(s),Female,"ABDOMINAL PAIN UPPER, DEHYDRATION, DIZZINESS, FEELING ABNORMAL, FEELING COLD, HEART RATE INCREASED, HYPOTENSION, LOSS OF CONSCIOUSNESS, TREMOR",Visited a Health Care Provider
1/6/2004,65432,12/5/2003,SUSPECT,ZANTREX 3,54,Vit/Min/Prot/Unconv Diet(Human/Animal),51.0,year(s),Female,"ERYTHEMA, FLUSHING, PARAESTHESIA",Visited Emergency Room
1/6/2004,65433,7/1/2002,SUSPECT,XENADRINE,54,Vit/Min/Prot/Unconv Diet(Human/Animal),35.0,year(s),Female,"HEADACHE, PAIN, TENDERNESS",Other Outcome
1/6/2004,65435,12/31/2003,SUSPECT,ROMA PIZZA,37,Mult Food Dinner/Grav/Sauce/Special,19.0,year(s),Male,FOOD POISONING,Other Outcome
1/6/2004,65436,12/31/2003,SUSPECT,ROMA PIZZA,37,Mult Food Dinner/Grav/Sauce/Special,,,,FOOD POISONING,Other Outcome
1/6/2004,65437,12/31/2003,SUSPECT,ROMA PIZZA,37,Mult Food Dinner/Grav/Sauce/Special,,,,FOOD POISONING,Other Outcome
1/6/2004,65438,11/1/2003,SUSPECT,COFFEE,31,Coffee/Tea,,,Female,"ARRHYTHMIA, BALANCE DISORDER, BLOOD PRESSURE INCREASED, CHEST PAIN, DIZZINESS, EAR, NOSE AND THROAT EXAMINATION, EXTRASYSTOLES, HOSPITALISATION, HYPERSENSITIVITY, ORTHOSTATIC HYPOTENSION, PALPITATIONS, PARAESTHESIA, PHYSICAL EXAMINATION, TINNITUS, VENTRICULAR EXTRASYSTOLES","Life Threatening, Disability"
1/6/2004,65438,11/1/2003,SUSPECT,DIET CAFFEINE FREE COKE,29,Soft Drink/Water,,,Female,"ARRHYTHMIA, BALANCE DISORDER, BLOOD PRESSURE INCREASED, CHEST PAIN, DIZZINESS, EAR, NOSE AND THROAT EXAMINATION, EXTRASYSTOLES, HOSPITALISATION, HYPERSENSITIVITY, ORTHOSTATIC HYPOTENSION, PALPITATIONS, PARAESTHESIA, PHYSICAL EXAMINATION, TINNITUS, VENTRICULAR EXTRASYSTOLES","Life Threatening, Disability"
1/6/2004,65438,11/1/2003,SUSPECT,DIET COKE,29,Soft Drink/Water,,,Female,"ARRHYTHMIA, BALANCE DISORDER, BLOOD PRESSURE INCREASED, CHEST PAIN, DIZZINESS, EAR, NOSE AND THROAT EXAMINATION, EXTRASYSTOLES, HOSPITALISATION, HYPERSENSITIVITY, ORTHOSTATIC HYPOTENSION, PALPITATIONS, PARAESTHESIA, PHYSICAL EXAMINATION, TINNITUS, VENTRICULAR EXTRASYSTOLES","Life Threatening, Disability"
1/6/2004,65438,11/1/2003,SUSPECT,JAMS,22,Fruit/Fruit Prod,,,Female,"ARRHYTHMIA, BALANCE DISORDER, BLOOD PRESSURE INCREASED, CHEST PAIN, DIZZINESS, EAR, NOSE AND THROAT EXAMINATION, EXTRASYSTOLES, HOSPITALISATION, HYPERSENSITIVITY, ORTHOSTATIC HYPOTENSION, PALPITATIONS, PARAESTHESIA, PHYSICAL EXAMINATION, TINNITUS, VENTRICULAR EXTRASYSTOLES","Life Threatening, Disability"
1/6/2004,65438,11/1/2003,SUSPECT,NUTRASWEET,45,Food Additives (Human Use),,,Female,"ARRHYTHMIA, BALANCE DISORDER, BLOOD PRESSURE INCREASED, CHEST PAIN, DIZZINESS, EAR, NOSE AND THROAT EXAMINATION, EXTRASYSTOLES, HOSPITALISATION, HYPERSENSITIVITY, ORTHOSTATIC HYPOTENSION, PALPITATIONS, PARAESTHESIA, PHYSICAL EXAMINATION, TINNITUS, VENTRICULAR EXTRASYSTOLES","Life Threatening, Disability"
1/6/2004,65438,11/1/2003,SUSPECT,PUDDINGS,35,Gelatin/Rennet/Pudding Mix/Pie Filling,,,Female,"ARRHYTHMIA, BALANCE DISORDER, BLOOD PRESSURE INCREASED, CHEST PAIN, DIZZINESS, EAR, NOSE AND THROAT EXAMINATION, EXTRASYSTOLES, HOSPITALISATION, HYPERSENSITIVITY, ORTHOSTATIC HYPOTENSION, PALPITATIONS, PARAESTHESIA, PHYSICAL EXAMINATION, TINNITUS, VENTRICULAR EXTRASYSTOLES","Life Threatening, Disability"
1/6/2004,65439,12/15/2003,SUSPECT,DORMANS SWISS CHEESE,12,Cheese/Cheese Prod,4.0,year(s),Female,MALAISE,Other Outcome
1/6/2004,65440,10/28/2003,SUSPECT,HERBS FOR LIFE GHR-GOLDALL NATURAL GROWTH HORMONE RELEASER NUTRITIONAL SUPPLEMENT,54,Vit/Min/Prot/Unconv Diet(Human/Animal),73.0,year(s),Male,Death,"Death, Life Threatening, Hospitalization, Visited a Health Care Provider"
1/6/2004,65443,3/7/2003,SUSPECT,MARUCHAN CREAMY PESTO INSTANT LUNCH NOODLES,4,Macaroni/Noodle Prod,,,,"ASTHENIA, DIZZINESS, MALAISE, NAUSEA",Other Outcome
1/6/2004,65450,4/7/2003,SUSPECT,SUNSWEET PRUNES,21,Fruit/Fruit Prod,,,Female,ABDOMINAL PAIN UPPER,Other Outcome
1/6/2004,65457,11/22/2003,SUSPECT,VICENZI NOCCIOLA (COOKIES),3,Bakery Prod/Dough/Mix/Icing,,,Male,ORAL DISCOMFORT,"Visited Emergency Room, Visited a Health Care Provider"
1/6/2004,65465,,SUSPECT,YEO HIAP SENG (M) BHD YEO'S SOYA BEAN DRINK VIETAMESE STYLE,24,Vegetables/Vegetable Products,,,Male,HAEMATOCHEZIA,Visited a Health Care Provider
1/6/2004,65468,12/15/2003,SUSPECT,JELLO OREO PUDDING SNACKS,35,Gelatin/Rennet/Pudding Mix/Pie Filling,10.0,year(s),Male,"ABDOMINAL PAIN, DIARRHOEA, MALAISE, VOMITING",Other Outcome
1/6/2004,65473,1/3/2004,SUSPECT,SNAPPLE DIET LEMON ICED TEA,31,Coffee/Tea,,,Female,"DEFAECATION URGENCY, DIARRHOEA, GASTROINTESTINAL DISORDER, MALAISE, VOMITING",Visited a Health Care Provider
1/7/2004,65486,,SUSPECT,TOPS BRAND FROSTED FLAKES (CORN FLAKES),5,Cereal Prep/Breakfast Food,,,Female,"DIARRHOEA, HYPOAESTHESIA ORAL, PARAESTHESIA",Other Outcome
1/7/2004,65487,,SUSPECT,ENSURE DRINK,41,Dietary Conventional Foods/Meal Replacements,,,Female,"ABDOMINAL PAIN, DIARRHOEA, Dysgeusia, FLATULENCE, HEADACHE",Other Outcome
1/7/2004,65489,11/23/2003,SUSPECT,REESE'S FAST BREAK PEANUT BUTTER AND NOUGAT CHOCOLATE BAR,34,Choc/Cocoa Prod,,,Male,"Nausea, Reaction to food additive",Other Outcome
1/7/2004,65491,12/23/2002,SUSPECT,SUNDOWN SAW PALMETTO,54,Vit/Min/Prot/Unconv Diet(Human/Animal),65.0,year(s),Male,"EPISTAXIS, HOSPITALISATION","Life Threatening, Visited Emergency Room, Visited a Health Care Provider"
1/7/2004,65496,1/5/2004,SUSPECT,"CLASSICO PASTA SAUCE, TOMATO AND BASIL",37,Mult Food Dinner/Grav/Sauce/Special,,,Female,Vomiting,Other Outcome
1/7/2004,65497,7/17/2003,SUSPECT,FRITO LAY WAVY RANCH POTATO CHIPS,7,Snack Food Item,,,Male,"HYPERHIDROSIS, MALAISE, VOMITING",Visited a Health Care Provider
1/8/2004,65508,8/9/2002,SUSPECT,POST WAFFLE CRISP,5,Cereal Prep/Breakfast Food,2.0,year(s),Female,"DIARRHOEA, DYSPEPSIA, VOMITING","Visited Emergency Room, Visited a Health Care Provider"
1/8/2004,65509,6/16/2003,SUSPECT,POPSICLES SPIDERMAN FIRECRACKER SUPER HEROES POPSICLES,13,Ice Cream Prod,,,Female,CHOKING,Other Outcome
1/8/2004,65510,,SUSPECT,CAPRI SUN FRUIT PUNCH,21,Fruit/Fruit Prod,9.0,year(s),Female,DYSPEPSIA,Other Outcome
1/8/2004,65513,,SUSPECT,JADRANKA TRADITIONAL PASTEURIZED RED PEPPERS,24,Vegetables/Vegetable Products,59.0,year(s),Female,"ANXIETY, ASTHENIA, DIARRHOEA, FATIGUE, HEADACHE, MOOD ALTERED, SALIVARY HYPERSECRETION, VISUAL DISTURBANCE, VOMITING",Other Outcome
1/8/2004,65516,,SUSPECT,AVACOR NUTRA CAP TABLETS,54,Vit/Min/Prot/Unconv Diet(Human/Animal),,,Female,"HYPOTRICHOSIS, TRICHORRHEXIS, UNEXPECTED THERAPEUTIC DRUG EFFECT",Other Outcome
1/8/2004,65516,,SUSPECT,AVACOR SHAMPOO,53,Cosmetics,,,Female,"HYPOTRICHOSIS, TRICHORRHEXIS, UNEXPECTED THERAPEUTIC DRUG EFFECT",Other Outcome
1/8/2004,65517,11/3/2003,SUSPECT,SOY BITE COOKIE (SOYBEAN),3,Bakery Prod/Dough/Mix/Icing,,,Male,DIARRHOEA,Other Outcome
1/8/2004,65518,11/4/2003,SUSPECT,MCCORMICK SALAD TOPPINS,23,Nuts/Edible Seed,,,Female,"DYSPNOEA, FEELING COLD, HYPERHIDROSIS, HYPERSENSITIVITY, TREMOR","Required Intervention, Visited Emergency Room"
1/8/2004,65519,11/12/2003,SUSPECT,GRILYAZZH RASPBERRY CANDY NUTS,33,Candy W/O Choc/Special/Chew Gum,,,Male,HYPERSENSITIVITY,Other Outcome
1/8/2004,65520,,SUSPECT,BALANCE BAR CHOCOLATE CRUNCH,7,Snack Food Item,,,Male,DIARRHOEA,Other Outcome
1/8/2004,65521,11/19/2003,SUSPECT,BAKER'S OVEN PUMPKIN PIE,35,Gelatin/Rennet/Pudding Mix/Pie Filling,,,Male,"DIARRHOEA, HYPERHIDROSIS, PAIN, RIGORS",Other Outcome
1/8/2004,65523,11/12/2003,SUSPECT,LANCE TOAST CHEESE SNACK CRACKERS,3,Bakery Prod/Dough/Mix/Icing,,,Male,"ABDOMINAL PAIN UPPER, DIARRHOEA, HEADACHE, PHYSICAL EXAMINATION",Visited Emergency Room
1/8/2004,65528,12/14/2003,SUSPECT,M AND M PEANUT CANDIES,34,Choc/Cocoa Prod,,,Female,"ASTHENIA, DIARRHOEA, MYALGIA, NAUSEA",Visited a Health Care Provider
1/8/2004,65529,,SUSPECT,DEAD SEA RUM FACIAL CREAM,53,Cosmetics,,,Female,"BURNING SENSATION, ERYTHEMA, SKIN DISCOLOURATION",Other Outcome
1/8/2004,65532,,SUSPECT,COCA-COLA VANILLA COKE,29,Soft Drink/Water,15.0,year(s),Female,ABDOMINAL PAIN UPPER,Other Outcome
1/8/2004,65533,12/2/2003,SUSPECT,POLAND SPRINGS SPRING WATER,29,Soft Drink/Water,,,Male,"ABDOMINAL PAIN, DIARRHOEA, NAUSEA, RIGORS",Other Outcome
1/9/2004,65545,6/3/2003,SUSPECT,V8 VEGETABLE JUICE,24,Vegetables/Vegetable Products,,,Male,"DIARRHOEA, VOMITING",Visited a Health Care Provider
1/9/2004,65546,6/24/2003,SUSPECT,BUNNY LOVE FRESH BABY CARROTS,25,Vegetables/Vegetable Products,66.0,year(s),Female,"DYSPNOEA, EMERGENCY CARE EXAMINATION, EYE IRRITATION, EYE OEDEMA, EYE PRURITUS, HOSPITALISATION, SINUS PAIN, SNEEZING, THROAT TIGHTNESS, VISION BLURRED","Hospitalization, Visited Emergency Room, Visited a Health Care Provider"
1/9/2004,65549,11/2/2003,SUSPECT,MISTIC SPARKLING LIME KIWI WATER,29,Soft Drink/Water,28.0,year(s),Female,"ABDOMINAL PAIN UPPER, BURNING SENSATION, DRY THROAT, HOSPITALISATION, NAUSEA","Hospitalization, Visited Emergency Room"
1/9/2004,65553,12/3/2003,SUSPECT,OTIS SPUNKMEYERS BANANA NUT MUFFINS,3,Bakery Prod/Dough/Mix/Icing,13.0,year(s),Female,"NAUSEA, THROAT IRRITATION",Visited a Health Care Provider
1/9/2004,65554,,SUSPECT,BUTTER FINGERS PEANUT BUTTER CANDIES,34,Choc/Cocoa Prod,,,Female,"ABDOMINAL PAIN, NAUSEA",Visited a Health Care Provider
1/9/2004,65555,12/4/2003,SUSPECT,HARRY AND DAVID'S RASPBERRY CHOCOLATE COVERED TRUFFLES,34,Choc/Cocoa Prod,,,Female,"ABDOMINAL PAIN, CHEST PAIN, MEDICATION ERROR, THROAT IRRITATION, URTICARIA, VOMITING",Visited a Health Care Provider
1/9/2004,65557,11/1/2003,SUSPECT,VITA SHRIMP COCKTAIL,16,Fishery/Seafood Prod,,,Female,"FLATULENCE, LOOSE STOOLS",Other Outcome
1/9/2004,65559,,SUSPECT,SKIPPY SKIPPY SQUEEZE IT,23,Nuts/Edible Seed,,,Male,"HOSPITALISATION, MALAISE, VOMITING","Hospitalization, Visited Emergency Room"
1/9/2004,65569,,SUSPECT,SUBWAY CHICKEN WRAP SANDWICH,37,Mult Food Dinner/Grav/Sauce/Special,17.0,year(s),Female,"BLOOD PRESSURE DECREASED, DYSPNOEA, EMERGENCY CARE EXAMINATION, ERYTHEMA, HYPERSENSITIVITY, SWELLING FACE","Required Intervention, Visited Emergency Room"
1/9/2004,65570,,SUSPECT,MAYONNAISE,27,Dressing/Condiment,,,Female,"ABDOMINAL DISTENSION, CHEST PAIN, DIARRHOEA, FLATULENCE, NAUSEA, VOMITING",Other Outcome
1/10/2004,65578,1/1/2003,SUSPECT,SALLY HANSEN BRUSH-ON BIKINI HAIR REMOVER CREAM,53,Cosmetics,25.0,year(s),Female,"BLISTER, BURNS SECOND DEGREE, ERYTHEMA, PHYSICAL EXAMINATION, SKIN BLEEDING, SKIN BURNING SENSATION",Visited a Health Care Provider
1/10/2004,65580,3/31/2003,SUSPECT,"CAMELOT WATER, SPRING",29,Soft Drink/Water,,,Female,ABDOMINAL PAIN,Other Outcome
1/10/2004,65594,,SUSPECT,WESTERN FAMILY 18 ASSORTED FLAVOR TWIN POPS,13,Ice Cream Prod,,,Female,HYPOAESTHESIA ORAL,Other Outcome
1/10/2004,65595,12/24/2003,SUSPECT,GIANT EAGLE 100% APPLE JUICE FROM CONCENTRATE,20,Fruit/Fruit Prod,,,Female,"HEADACHE, NASAL CONGESTION, PHARYNGOLARYNGEAL PAIN, PYREXIA",Other Outcome
1/10/2004,65596,12/16/2003,SUSPECT,M AND M PEANUT CANDY,33,Candy W/O Choc/Special/Chew Gum,,,Female,VOMITING,Other Outcome
1/10/2004,65597,,SUSPECT,KELLOGG'S FRUIT AND HARVEST CEREAL,5,Cereal Prep/Breakfast Food,,,Female,"CAUSTIC INJURY, PHARYNGITIS",Other Outcome
1/10/2004,65598,,SUSPECT,DOLE APPLE JUICE,20,Fruit/Fruit Prod,,,Male,Malaise,Other Outcome
1/11/2004,65610,,SUSPECT,LUNA NUTS OVER CHOCOLATE ENERGY BAR,7,Snack Food Item,,,Male,"DIARRHOEA, NAUSEA",Other Outcome
1/11/2004,65611,6/30/2003,SUSPECT,HERSHEY'S CHOCOLATE BARS,34,Choc/Cocoa Prod,,,Female,VOMITING,Visited Emergency Room
1/11/2004,65613,7/7/2003,SUSPECT,GREEN GIANT SPINACH WITH NO SAUCE,24,Vegetables/Vegetable Products,,,Male,NAUSEA,Other Outcome
1/12/2004,65615,12/2/2003,SUSPECT,POLAND SPRINGS SPRING WATER,29,Soft Drink/Water,4.0,year(s),Female,"ABDOMINAL PAIN, DIARRHOEA, MALAISE, NAUSEA, RIGORS",Other Outcome
1/12/2004,65616,9/21/2003,SUSPECT,GOOD DAY 1% LOWFAT MILK,9,Milk/Butter/Dried Milk Prod,,,Male,PARAESTHESIA ORAL,Other Outcome
1/12/2004,65617,9/21/2003,SUSPECT,GOOD DAY 1% LOWFAT MILK,9,Milk/Butter/Dried Milk Prod,,,Female,PARAESTHESIA ORAL,Other Outcome
1/12/2004,65618,9/21/2003,SUSPECT,GOOD DAY 1% LOWFAT MILK,9,Milk/Butter/Dried Milk Prod,3.0,year(s),Male,PARAESTHESIA ORAL,Other Outcome
1/12/2004,65619,12/22/2003,SUSPECT,ACEYTL-L-CARNITINE,54,Vit/Min/Prot/Unconv Diet(Human/Animal),70.0,year(s),Male,"ASTHENIA, DEPRESSED MOOD, DIZZINESS, IMPAIRED DRIVING ABILITY, LETHARGY, PHYSICAL EXAMINATION",Disability
1/12/2004,65619,12/22/2003,SUSPECT,ALPHA LIPOIC,54,Vit/Min/Prot/Unconv Diet(Human/Animal),70.0,year(s),Male,"ASTHENIA, DEPRESSED MOOD, DIZZINESS, IMPAIRED DRIVING ABILITY, LETHARGY, PHYSICAL EXAMINATION",Disability
1/12/2004,65619,12/22/2003,SUSPECT,CALCIUM CALTRATE,54,Vit/Min/Prot/Unconv Diet(Human/Animal),70.0,year(s),Male,"ASTHENIA, DEPRESSED MOOD, DIZZINESS, IMPAIRED DRIVING ABILITY, LETHARGY, PHYSICAL EXAMINATION",Disability
1/12/2004,65619,12/22/2003,SUSPECT,MULTIVITAMIN,54,Vit/Min/Prot/Unconv Diet(Human/Animal),70.0,year(s),Male,"ASTHENIA, DEPRESSED MOOD, DIZZINESS, IMPAIRED DRIVING ABILITY, LETHARGY, PHYSICAL EXAMINATION",Disability
1/12/2004,65619,12/22/2003,SUSPECT,VITAMIN E,54,Vit/Min/Prot/Unconv Diet(Human/Animal),70.0,year(s),Male,"ASTHENIA, DEPRESSED MOOD, DIZZINESS, IMPAIRED DRIVING ABILITY, LETHARGY, PHYSICAL EXAMINATION",Disability
1/12/2004,65622,6/26/2003,SUSPECT,EPHEDRA,54,Vit/Min/Prot/Unconv Diet(Human/Animal),54.0,year(s),Female,"FEELING ABNORMAL, HEART RATE INCREASED, MUSCLE INJURY, PALPITATIONS, TACHYCARDIA","Life Threatening, Required Intervention, Visited a Health Care Provider"
1/12/2004,65622,6/26/2003,CONCOMITANT,CALCIUM,54,Vit/Min/Prot/Unconv Diet(Human/Animal),54.0,year(s),Female,"FEELING ABNORMAL, HEART RATE INCREASED, MUSCLE INJURY, PALPITATIONS, TACHYCARDIA","Life Threatening, Required Intervention, Visited a Health Care Provider"
1/12/2004,65622,6/26/2003,CONCOMITANT,ONE A DAY MULTIVITAMIN,54,Vit/Min/Prot/Unconv Diet(Human/Animal),54.0,year(s),Female,"FEELING ABNORMAL, HEART RATE INCREASED, MUSCLE INJURY, PALPITATIONS, TACHYCARDIA","Life Threatening, Required Intervention, Visited a Health Care Provider"
1/12/2004,65622,6/26/2003,CONCOMITANT,PRIMROSE OIL,54,Vit/Min/Prot/Unconv Diet(Human/Animal),54.0,year(s),Female,"FEELING ABNORMAL, HEART RATE INCREASED, MUSCLE INJURY, PALPITATIONS, TACHYCARDIA","Life Threatening, Required Intervention, Visited a Health Care Provider"
1/12/2004,65622,6/26/2003,CONCOMITANT,VITAMIN E,54,Vit/Min/Prot/Unconv Diet(Human/Animal),54.0,year(s),Female,"FEELING ABNORMAL, HEART RATE INCREASED, MUSCLE INJURY, PALPITATIONS, TACHYCARDIA","Life Threatening, Required Intervention, Visited a Health Care Provider"
1/12/2004,65624,,SUSPECT,GIANT EAGLE 100% APPLE JUICE FROM CONCENTRATE,20,Fruit/Fruit Prod,,,,"DIARRHOEA, HEADACHE, NASAL CONGESTION, PYREXIA",Other Outcome
1/12/2004,65625,,SUSPECT,GIANT EAGLE 100% APPLE JUICE FROM CONCENTRATE,20,Fruit/Fruit Prod,,,,"DIARRHOEA, HEADACHE, NASAL CONGESTION, PYREXIA",Other Outcome
1/12/2004,65626,,SUSPECT,GIANT EAGLE 100% APPLE JUICE FROM CONCENTRATE,20,Fruit/Fruit Prod,,,,"HEADACHE, NASAL CONGESTION, PHARYNGITIS, PYREXIA",Other Outcome