﻿Report ID,CAERS Created Date,Date of Event,Product Type,Product,Product Code,Description,Patient Age,Age Units,Sex,MedDRA Preferred Terms,Outcomes
2018-CFS-000002,1/2/2018,5/14/2017,SUSPECT,CORAL CALCIUM,54, Vit/Min/Prot/Unconv Diet(Human/Animal),,,F,"BLOOD CALCIUM INCREASED, RENAL DISORDER","Hospitalization, Patient Visited ER"
2018-CFS-000003,1/2/2018,,SUSPECT,EXEMPTION 4,53, Cosmetics,50,year(s),F,DEATH,Death
2018-CFS-000004,1/2/2018,9/22/2011,SUSPECT,EXEMPTION 4,53, Cosmetics,57,year(s),F,OVARIAN CANCER STAGE III,"Hospitalization, Medically Important"
2018-CFS-000005,1/2/2018,,SUSPECT,EXEMPTION 4,53, Cosmetics,60,year(s),F,DEATH,Death
2018-CFS-000006,1/2/2018,,SUSPECT,EXEMPTION 4,53, Cosmetics,70,year(s),F,DEATH,Death
2018-CFS-000007,1/2/2018,,SUSPECT,CELLUCOR ALPHA AMINO,54, Vit/Min/Prot/Unconv Diet(Human/Animal),15,year(s),M,"DYSPNOEA, GAIT DISTURBANCE, OCULAR HYPERAEMIA","Other Seriousness, Patient Visited ER"
2018-CFS-000008,1/2/2018,,SUSPECT,Eco Style Professional Styling Gel  Black Castor and Flax Seed Oil,53, Cosmetics,,,F,PRURITUS,Other Outcome
2018-CFS-000009,1/2/2018,,SUSPECT,ECO STYLE PROFESSIONAL STYLING GEL BLACK CASTOR & FLAX SEED OIL,53, Cosmetics,,,F,PRURITUS,Other Outcome
2018-CFS-000010,1/2/2018,,SUSPECT,SOY MASKING AGENTS,45, Food Additives (Human Use),36,year(s),F,"THROAT IRRITATION, EYE IRRITATION",Disability
2018-CFS-000018,1/2/2018,12/26/2017,SUSPECT,ECO STYLING GEL,53, Cosmetics,25,year(s),F,PRURITUS,Other Outcome
2018-CFS-000019,1/2/2018,11/23/2017,SUSPECT,RESERS MAIN ST BISTRO MASHED POTATOES,25, Vegetables/Vegetable Products,60,year(s),F,"GASTROINTESTINAL DISORDER, INSOMNIA, PRURITUS",Other Outcome
2018-CFS-000020,1/2/2018,10/27/2017,SUSPECT,KRATOM,54, Vit/Min/Prot/Unconv Diet(Human/Animal),31,year(s),M,"DEPENDENCE, ELECTROCARDIOGRAM ABNORMAL, CONVULSION, ACTIVITIES OF DAILY LIVING IMPAIRED","Hospitalization, Patient Visited Healthcare Provider"
2018-CFS-000021,1/2/2018,12/26/2017,SUSPECT,WHIPPED SOAP LE VIE EST BELLE TYPE,53, Cosmetics,35,year(s),F,"HYPERSENSITIVITY, RASH PRURITIC",Other Outcome
2018-CFS-000022,1/2/2018,12/21/2017,SUSPECT,MARUCHAN RAMEN NOODLES,4, Macaroni/Noodle Prod,51,year(s),,"SINUS HEADACHE, MALAISE","Patient Visited Healthcare Provider, Medically Important"
2018-CFS-000024,1/2/2018,11/1/2017,SUSPECT,ECO STYLER,53, Cosmetics,,,F,"HAIR TEXTURE ABNORMAL, TRICHORRHEXIS",Other Outcome
2018-CFS-000025,1/2/2018,11/25/2017,SUSPECT,LIMBREL 500,41G," Medical Foods, N.E.C.",57,year(s),F,CARDIAC DISORDER,Medically Important
2018-CFS-000025,1/2/2018,11/25/2017,CONCOMITANT,Vitamin D,54, Vit/Min/Prot/Unconv Diet(Human/Animal),57,year(s),F,CARDIAC DISORDER,Medically Important
2018-CFS-000025,1/2/2018,11/25/2017,CONCOMITANT,Vitamin E,54, Vit/Min/Prot/Unconv Diet(Human/Animal),57,year(s),F,CARDIAC DISORDER,Medically Important
2018-CFS-000025,1/2/2018,11/25/2017,CONCOMITANT,Magnesium,54, Vit/Min/Prot/Unconv Diet(Human/Animal),57,year(s),F,CARDIAC DISORDER,Medically Important
2018-CFS-000026,1/2/2018,12/21/2017,SUSPECT,DASANI PURIFIED WATER,29, Soft Drink/Water,,,M,"ABDOMINAL PAIN UPPER, VIRAL INFECTION, CHILLS, HEADACHE, OROPHARYNGEAL PAIN, NIGHT SWEATS",Hospitalization
2018-CFS-000027,1/2/2018,12/27/2017,SUSPECT,TERRACOTTA BRONZING POWDER,53, Cosmetics,19,year(s),F,"HYPERSENSITIVITY, SWELLING, RASH, ERYTHEMA",Other Outcome
2018-CFS-000029,1/2/2018,12/27/2017,SUSPECT,MAGNESIUM GLYCINATE,54, Vit/Min/Prot/Unconv Diet(Human/Animal),61,year(s),F,CARDIAC FAILURE,"Life Threatening, Disability"
2018-CFS-000030,1/2/2018,12/27/2017,SUSPECT,UNCLE BEN'S READY RICE GARDEN VEGETABLE,2, Whole Grain/Milled Grain Prod/Starch,37,year(s),F,"ABDOMINAL DISCOMFORT, ABDOMINAL PAIN UPPER",Medically Important
2018-CFS-000032,1/2/2018,12/21/2017,SUSPECT,JAMBALAYA ENTREE MIX,37, Mult Food Dinner/Grav/Sauce/Special,53,year(s),M,"DIARRHOEA, NAUSEA",Other Seriousness
2018-CFS-000033,1/2/2018,,SUSPECT,SWANSON PROBIOTICS SACCHAROMYCES BOULARDII,54, Vit/Min/Prot/Unconv Diet(Human/Animal),,,M,ADVERSE EVENT,"Medically Important, Patient Visited ER"
2018-CFS-000035,1/2/2018,,SUSPECT,D-MANNOSE PURE POWDER,54, Vit/Min/Prot/Unconv Diet(Human/Animal),85,year(s),M,"URINARY TRACT INFECTION, BLOOD URINE PRESENT",Hospitalization
2018-CFS-000035,1/2/2018,,CONCOMITANT,C-1000,54, Vit/Min/Prot/Unconv Diet(Human/Animal),85,year(s),M,"URINARY TRACT INFECTION, BLOOD URINE PRESENT",Hospitalization
2018-CFS-000035,1/2/2018,,CONCOMITANT,Vitamin D-3,54, Vit/Min/Prot/Unconv Diet(Human/Animal),85,year(s),M,"URINARY TRACT INFECTION, BLOOD URINE PRESENT",Hospitalization
2018-CFS-000035,1/2/2018,,CONCOMITANT,Cal Magnesium,54, Vit/Min/Prot/Unconv Diet(Human/Animal),85,year(s),M,"URINARY TRACT INFECTION, BLOOD URINE PRESENT",Hospitalization
2018-CFS-000036,1/2/2018,12/30/2017,SUSPECT,GOLD DUST ADVANCED MEGA STIM PRE-WORKOUT,54, Vit/Min/Prot/Unconv Diet(Human/Animal),18,year(s),M,"NAUSEA, HAEMATEMESIS, AMPHETAMINES POSITIVE, COLD SWEAT, BLOOD PRESSURE INCREASED, BLOOD URINE, DEHYDRATION, URINE ABNORMALITY, DIZZINESS, TACHYCARDIA, ABDOMINAL PAIN","Life Threatening, Hospitalization, Patient Visited ER"
2018-CFS-000037,1/2/2018,12/21/2017,SUSPECT,DASANI PURIFIED WATER,29, Soft Drink/Water,,,,"VIRAL INFECTION, ABDOMINAL PAIN UPPER, HEADACHE, OROPHARYNGEAL PAIN, NIGHT SWEATS, CHILLS",Hospitalization
2018-CFS-000039,1/3/2018,12/28/2017,SUSPECT,SLICED APPLES,20, Fruit/Fruit Prod,29,year(s),F,"MALAISE, FOOD POISONING",Medically Important
2018-CFS-000040,1/3/2018,12/29/2017,SUSPECT,100% VIRGIN COCONUT OIL HYDRATION MILK MASK,53, Cosmetics,25,year(s),F,"ERYTHEMA, BURNING SENSATION",Other Outcome
2018-CFS-000041,1/3/2018,12/29/2017,SUSPECT,INSTANT FULL COVER CONCEALER,53, Cosmetics,51,year(s),F,"RASH, BURNING SENSATION, SWELLING, ERYTHEMA, DERMATITIS",Other Outcome
2018-CFS-000042,1/3/2018,12/29/2017,SUSPECT,EYELASH EXTENSIONS,53, Cosmetics,,,F,"EYELID PAIN, EYE IRRITATION",Other Outcome
2018-CFS-000043,1/3/2018,11/15/2017,SUSPECT,JAMIESON ACIDOPHILUS,54, Vit/Min/Prot/Unconv Diet(Human/Animal),65,year(s),M,"RASH, SKIN LESION",Other Seriousness
2018-CFS-000044,1/3/2018,12/29/2017,SUSPECT,5 GUM,33, Candy W/O Choc/Special/Chew Gum,,,F,"ABDOMINAL DISTENSION, DIARRHOEA",Medically Important
2018-CFS-000046,1/3/2018,12/26/2017,SUSPECT,NYX CRYSTAL LINER,53, Cosmetics,20,year(s),F,CHEMICAL INJURY,Other Outcome
2018-CFS-000050,1/3/2018,12/5/2015,SUSPECT,KRATOM,54, Vit/Min/Prot/Unconv Diet(Human/Animal),33,year(s),M,"DEPENDENCE, NAUSEA, INSOMNIA, SUICIDAL IDEATION, ANXIETY, WITHDRAWAL SYNDROME, DRUG DEPENDENCE, DEPRESSION, RESTLESSNESS",Disability
2018-CFS-000052,1/3/2018,12/28/2017,SUSPECT,LAYS CLASSIC POTATO CHIPS,7, Snack Food Item,44,year(s),F,MALAISE,Medically Important
2018-CFS-000054,1/3/2018,,SUSPECT,EOS SWEET MINT LIP BALM,53, Cosmetics,38,year(s),F,"CHAPPED LIPS, CHEILITIS, ERYTHEMA, HAEMORRHAGE, ORAL DISCOMFORT, PAIN, PRURITUS",Other Outcome
2018-CFS-000054,1/3/2018,,CONCOMITANT,MVI,54, Vit/Min/Prot/Unconv Diet(Human/Animal),38,year(s),F,"CHAPPED LIPS, CHEILITIS, ERYTHEMA, HAEMORRHAGE, ORAL DISCOMFORT, PAIN, PRURITUS",Other Outcome
2018-CFS-000061,1/3/2018,12/31/2017,SUSPECT,E.L.F. ILLUMINATING EYE CREAM,53, Cosmetics,,,F,"BURNING SENSATION, PAIN, URTICARIA, FLUSHING",Other Outcome
2018-CFS-000063,1/3/2018,,SUSPECT,SUPER BETA PROSTATE,54, Vit/Min/Prot/Unconv Diet(Human/Animal),,,M,MALAISE,"Hospitalization, Medically Important"
2018-CFS-000064,1/3/2018,,SUSPECT,THYROID 180,54, Vit/Min/Prot/Unconv Diet(Human/Animal),,,F,VAGINAL HAEMORRHAGE,Other Seriousness
2018-CFS-000065,1/3/2018,,SUSPECT,METABO379,54, Vit/Min/Prot/Unconv Diet(Human/Animal),72,year(s),F,DIVERTICULITIS,"Hospitalization, Patient Visited ER"
2018-CFS-000065,1/3/2018,,CONCOMITANT,multivitamins,54, Vit/Min/Prot/Unconv Diet(Human/Animal),72,year(s),F,DIVERTICULITIS,"Hospitalization, Patient Visited ER"
2018-CFS-000065,1/3/2018,,CONCOMITANT,supplemental calcium,54, Vit/Min/Prot/Unconv Diet(Human/Animal),72,year(s),F,DIVERTICULITIS,"Hospitalization, Patient Visited ER"
2018-CFS-000065,1/3/2018,,CONCOMITANT,vitaminC,54, Vit/Min/Prot/Unconv Diet(Human/Animal),72,year(s),F,DIVERTICULITIS,"Hospitalization, Patient Visited ER"
2018-CFS-000066,1/3/2018,,SUSPECT,LEPTIBURN,54, Vit/Min/Prot/Unconv Diet(Human/Animal),,,F,ADVERSE REACTION,Hospitalization
2018-CFS-000070,1/4/2018,,SUSPECT,EXTRA DARK CHOCOLATE TRUFFLES,34, Choc/Cocoa Prod,,,F,BURNING SENSATION,Other Seriousness
2018-CFS-000073,1/4/2018,,SUSPECT,FOOD FACILITY COMPLAINT,37, Mult Food Dinner/Grav/Sauce/Special,,,,INFLUENZA,Other Outcome
2018-CFS-000075,1/4/2018,12/2/2017,SUSPECT,FREE RANGE CHICKEN BROTH LOW SODIUM,38, Soup,,,,"ABDOMINAL PAIN, CHEST PAIN, DIARRHOEA, HEADACHE, NAUSEA, PALPITATIONS, VOMITING",Other Seriousness
2018-CFS-000076,1/4/2018,,SUSPECT,EXEMPTION 4,53, Cosmetics,32,year(s),F,HAIR GROWTH ABNORMAL,Medically Important
2018-CFS-000077,1/4/2018,11/12/2017,SUSPECT,SHAKEOLOGY CHOCOLATE,54, Vit/Min/Prot/Unconv Diet(Human/Animal),,,M,"BEDRIDDEN, DIVERTICULUM, ABDOMINAL PAIN, INFECTION",Medically Important
2018-CFS-000078,1/4/2018,12/31/2014,SUSPECT,EXEMPTION 4,53, Cosmetics,43,year(s),F,"OVARIAN CANCER STAGE I, EXPOSURE TO CHEMICAL POLLUTION","Hospitalization, Medically Important"
2018-CFS-000078,1/4/2018,12/31/2014,SUSPECT,EXEMPTION 4,53, Cosmetics,43,year(s),F,"OVARIAN CANCER STAGE I, EXPOSURE TO CHEMICAL POLLUTION","Hospitalization, Medically Important"
2018-CFS-000079,1/4/2018,12/19/2017,SUSPECT,THYROID PERFORMANCE PLUS,54, Vit/Min/Prot/Unconv Diet(Human/Animal),70,year(s),F,"CARDIAC MURMUR, LOCAL SWELLING, WEIGHT INCREASED",Medically Important
2018-CFS-000080,1/4/2018,,SUSPECT,OJC PLUS BERRY GREENS,54, Vit/Min/Prot/Unconv Diet(Human/Animal),,,F,"GASTROINTESTINAL PAIN, DIVERTICULITIS","Hospitalization, Medically Important"
2018-CFS-000081,1/4/2018,12/13/2017,SUSPECT,FLINTSTONES COMPLETE,54, Vit/Min/Prot/Unconv Diet(Human/Animal),57,year(s),M,"DYSPHAGIA, CHOKING",Medically Important
2018-CFS-000082,1/4/2018,,SUSPECT,CITRACAL MAXIMUM,54, Vit/Min/Prot/Unconv Diet(Human/Animal),77,year(s),F,VOMITING,Medically Important
2018-CFS-000083,1/4/2018,10/17/2017,SUSPECT,EXEMPTION 4,53, Cosmetics,82,year(s),F,EXPOSURE TO CHEMICAL POLLUTION,Medically Important
2018-CFS-000084,1/4/2018,,SUSPECT,CITRACAL PLUS MAXIMUM,54, Vit/Min/Prot/Unconv Diet(Human/Animal),75,year(s),F,"CHOKING, DYSPHAGIA",Medically Important
2018-CFS-000085,1/4/2018,,SUSPECT,MAXIMUM STRENGTH MELATONIN,54, Vit/Min/Prot/Unconv Diet(Human/Animal),54,year(s),F,"INFLUENZA LIKE ILLNESS, TINNITUS, GLYCOSYLATED HAEMOGLOBIN INCREASED, BLOOD GLUCOSE INCREASED, MALAISE",Medically Important
2018-CFS-000086,1/4/2018,,SUSPECT,EXEMPTION 4,53, Cosmetics,68,year(s),F,DEATH,Death
2018-CFS-000087,1/4/2018,12/2/2017,SUSPECT,NATURALIST PROBIOTIC ACIDOPHILUS W/CITRUS PECTIN,54, Vit/Min/Prot/Unconv Diet(Human/Animal),50,year(s),F,"ASTHMA, DYSPNOEA, FATIGUE, BLOOD PRESSURE INCREASED, CHRONIC OBSTRUCTIVE PULMONARY DISEASE, CHEST PAIN, MALAISE, ABDOMINAL PAIN","Patient Visited Healthcare Provider, Medically Important, Patient Visited ER"
2018-CFS-000087,1/4/2018,12/2/2017,CONCOMITANT,MAGNESIUM,54, Vit/Min/Prot/Unconv Diet(Human/Animal),50,year(s),F,"ASTHMA, DYSPNOEA, FATIGUE, BLOOD PRESSURE INCREASED, CHRONIC OBSTRUCTIVE PULMONARY DISEASE, CHEST PAIN, MALAISE, ABDOMINAL PAIN","Patient Visited Healthcare Provider, Medically Important, Patient Visited ER"
2018-CFS-000089,1/4/2018,,SUSPECT,PURITANS PRIDE NEURO-PS,54, Vit/Min/Prot/Unconv Diet(Human/Animal),95,year(s),F,AUTOSCOPY,"Patient Visited Healthcare Provider, Medically Important"
2018-CFS-000090,1/4/2018,9/5/2017,SUSPECT,EXEMPTION 4,53, Cosmetics,70,year(s),M,"EXPOSURE TO CHEMICAL POLLUTION, EPITHELIOID MESOTHELIOMA","Hospitalization, Medically Important"
2018-CFS-000091,1/4/2018,,SUSPECT,CITRACAL MAXIMUM,54, Vit/Min/Prot/Unconv Diet(Human/Animal),,,M,CHOKING,Medically Important
2018-CFS-000092,1/4/2018,,SUSPECT,EXEMPTION 4,53, Cosmetics,,,F,DEATH,Death
2018-CFS-000093,1/4/2018,,SUSPECT,EXEMPTION 4,53, Cosmetics,,,F,EXPOSURE TO CHEMICAL POLLUTION,Medically Important
2018-CFS-000094,1/4/2018,9/25/2017,SUSPECT,EXEMPTION 4,53, Cosmetics,70,year(s),F,"DEATH, EXPOSURE TO CHEMICAL POLLUTION",Death
2018-CFS-000096,1/4/2018,,SUSPECT,EXEMPTION 4,53, Cosmetics,50,year(s),F,OVARIAN CANCER,Medically Important
2018-CFS-000097,1/4/2018,,SUSPECT,EXEMPTION 4,53, Cosmetics,64,year(s),F,DEATH,Death
2018-CFS-000098,1/4/2018,,SUSPECT,EXEMPTION 4,53, Cosmetics,89,year(s),F,OVARIAN CANCER,Death
2018-CFS-000099,1/4/2018,9/8/2017,SUSPECT,EXEMPTION 4,53, Cosmetics,72,year(s),F,"BIPHASIC MESOTHELIOMA, EXPOSURE TO CHEMICAL POLLUTION","Death, Hospitalization, Medically Important"
2018-CFS-000100,1/4/2018,2/14/2014,SUSPECT,EXEMPTION 4,53, Cosmetics,41,year(s),F,"DEATH, OVARIAN CANCER STAGE III","Death, Hospitalization, Medically Important"
2018-CFS-000100,1/4/2018,2/14/2014,SUSPECT,EXEMPTION 4,53, Cosmetics,41,year(s),F,"DEATH, OVARIAN CANCER STAGE III","Death, Hospitalization, Medically Important"
2018-CFS-000101,1/4/2018,1/11/2017,SUSPECT,EXEMPTION 4,53, Cosmetics,37,year(s),M,EXPOSURE TO CHEMICAL POLLUTION,Medically Important
2018-CFS-000102,1/4/2018,,SUSPECT,EXEMPTION 4,53, Cosmetics,73,year(s),M,"DEATH, EXPOSURE TO CHEMICAL POLLUTION",Death
2018-CFS-000103,1/4/2018,11/2/2011,SUSPECT,EXEMPTION 4,53, Cosmetics,40,year(s),F,DEATH,Death
2018-CFS-000104,1/4/2018,12/8/2017,SUSPECT,EXEMPTION 4,53, Cosmetics,39,year(s),F,"EYELID IRRITATION, CHEMICAL INJURY, DRY EYE, EYE IRRITATION, EYELID OEDEMA, EYE PAIN",Patient Visited Healthcare Provider
2018-CFS-000109,1/5/2018,11/16/2017,SUSPECT,IRON,54, Vit/Min/Prot/Unconv Diet(Human/Animal),42,year(s),F,"THROAT TIGHTNESS, SWELLING FACE, LIP SWELLING, ODYNOPHAGIA, ORAL PRURITUS, DYSPHAGIA, HYPERSENSITIVITY",Medically Important
2018-CFS-000109,1/5/2018,11/16/2017,CONCOMITANT,MULTIVITAMIN,54, Vit/Min/Prot/Unconv Diet(Human/Animal),42,year(s),F,"THROAT TIGHTNESS, SWELLING FACE, LIP SWELLING, ODYNOPHAGIA, ORAL PRURITUS, DYSPHAGIA, HYPERSENSITIVITY",Medically Important
2018-CFS-000110,1/5/2018,,SUSPECT,SUBLINGUAL LIQUID B COMPLEX,54, Vit/Min/Prot/Unconv Diet(Human/Animal),,,F,"PUPILLARY REFLEX IMPAIRED, LOSS OF CONSCIOUSNESS, RUBBER SENSITIVITY, DYSPNOEA, CONVULSION, LIP SWELLING","Patient Visited Healthcare Provider, Medically Important"
2018-CFS-000111,1/5/2018,11/17/2017,SUSPECT,NAC N-ACETYL CYSTEINE,54, Vit/Min/Prot/Unconv Diet(Human/Animal),67,year(s),M,"HYPOAESTHESIA, ATROPHY, GAIT DISTURBANCE, BLOOD TEST ABNORMAL",Medically Important
2018-CFS-000111,1/5/2018,11/17/2017,SUSPECT,PYCNOGENOL,54, Vit/Min/Prot/Unconv Diet(Human/Animal),67,year(s),M,"HYPOAESTHESIA, ATROPHY, GAIT DISTURBANCE, BLOOD TEST ABNORMAL",Medically Important
2018-CFS-000111,1/5/2018,11/17/2017,SUSPECT,FORSKOLIN,54, Vit/Min/Prot/Unconv Diet(Human/Animal),67,year(s),M,"HYPOAESTHESIA, ATROPHY, GAIT DISTURBANCE, BLOOD TEST ABNORMAL",Medically Important
2018-CFS-000111,1/5/2018,11/17/2017,SUSPECT,C-1000MG WITH BIOFLAVONOIDS AND WILD ROSE HIPS,54, Vit/Min/Prot/Unconv Diet(Human/Animal),67,year(s),M,"HYPOAESTHESIA, ATROPHY, GAIT DISTURBANCE, BLOOD TEST ABNORMAL",Medically Important
2018-CFS-000111,1/5/2018,11/17/2017,SUSPECT,CO Q-10,54, Vit/Min/Prot/Unconv Diet(Human/Animal),67,year(s),M,"HYPOAESTHESIA, ATROPHY, GAIT DISTURBANCE, BLOOD TEST ABNORMAL",Medically Important
2018-CFS-000111,1/5/2018,11/17/2017,SUSPECT,NIACINAMIDE,54, Vit/Min/Prot/Unconv Diet(Human/Animal),67,year(s),M,"HYPOAESTHESIA, ATROPHY, GAIT DISTURBANCE, BLOOD TEST ABNORMAL",Medically Important
2018-CFS-000112,1/5/2018,,SUSPECT,C-500MG WITH WILD ROSE HIPS,54, Vit/Min/Prot/Unconv Diet(Human/Animal),80,year(s),M,"ASTHENIA, HEADACHE, ARRHYTHMIA, FATIGUE, ANXIETY, PALPITATIONS","Medically Important, Patient Visited ER"
2018-CFS-000112,1/5/2018,,CONCOMITANT,Vitamin D3,54, Vit/Min/Prot/Unconv Diet(Human/Animal),80,year(s),M,"ASTHENIA, HEADACHE, ARRHYTHMIA, FATIGUE, ANXIETY, PALPITATIONS","Medically Important, Patient Visited ER"
2018-CFS-000113,1/5/2018,,SUSPECT,"HAIR, SKIN & NAILS BIOTIN",54, Vit/Min/Prot/Unconv Diet(Human/Animal),70,year(s),F,"BLOOD PRESSURE INCREASED, DRY EYE, ABDOMINAL DISCOMFORT",Medically Important
2018-CFS-000113,1/5/2018,,CONCOMITANT,One a Day Multivitamin,54, Vit/Min/Prot/Unconv Diet(Human/Animal),70,year(s),F,"BLOOD PRESSURE INCREASED, DRY EYE, ABDOMINAL DISCOMFORT",Medically Important
2018-CFS-000114,1/5/2018,11/30/2017,SUSPECT,GLUCOSAMINE CHONDROITIN MSM,54, Vit/Min/Prot/Unconv Diet(Human/Animal),71,year(s),M,"CHOKING, VOMITING","Life Threatening, Medically Important"
2018-CFS-000115,1/5/2018,11/23/2017,SUSPECT,E-400 IU RAPID RELEASE SOFTGELS,54, Vit/Min/Prot/Unconv Diet(Human/Animal),66,year(s),M,"COUGH, LIP SWELLING, ANAPHYLACTIC REACTION, CHEST DISCOMFORT, TONGUE OEDEMA, THROAT TIGHTNESS, WHEEZING",Medically Important
2018-CFS-000116,1/5/2018,12/2/2017,SUSPECT,VITAMIN D3,54, Vit/Min/Prot/Unconv Diet(Human/Animal),65,year(s),F,THROAT TIGHTNESS,Medically Important
2018-CFS-000116,1/5/2018,12/2/2017,CONCOMITANT,Yeast Rice,54, Vit/Min/Prot/Unconv Diet(Human/Animal),65,year(s),F,THROAT TIGHTNESS,Medically Important
2018-CFS-000116,1/5/2018,12/2/2017,CONCOMITANT,Digestive Enzyme,54, Vit/Min/Prot/Unconv Diet(Human/Animal),65,year(s),F,THROAT TIGHTNESS,Medically Important
2018-CFS-000117,1/5/2018,,SUSPECT,PROBIOTIC 2 BILLION LIVE CULTURES,54, Vit/Min/Prot/Unconv Diet(Human/Animal),69,year(s),F,"PRURITUS GENERALISED, MALAISE, HEADACHE, VOMITING, TREMOR, HYPERHIDROSIS, MUSCLE SPASMS, DIARRHOEA, NAUSEA, TONIC CLONIC MOVEMENTS","Patient Visited Healthcare Provider, Medically Important"
2018-CFS-000118,1/5/2018,12/8/2017,SUSPECT,OPTIMIZED NAD + CELL REGENERATOR,54, Vit/Min/Prot/Unconv Diet(Human/Animal),57,year(s),M,"INSOMNIA, BLOOD PRESSURE INCREASED",Hospitalization
2018-CFS-000121,1/5/2018,5/3/2017,SUSPECT,ARBONNE ESSENTIALS 7-DAY BODY CLEANSE,54, Vit/Min/Prot/Unconv Diet(Human/Animal),57,year(s),F,"HYPERSENSITIVITY, SWELLING, URTICARIA, DYSPHAGIA, DYSPNOEA","Medically Important, Patient Visited ER"
2018-CFS-000122,1/5/2018,10/30/2017,SUSPECT,DIGESTIVE FREEDOM PLUS,54, Vit/Min/Prot/Unconv Diet(Human/Animal),69,year(s),F,"PAIN, ABDOMINAL PAIN","Medically Important, Patient Visited ER"
2018-CFS-000124,1/5/2018,12/28/2017,SUSPECT,VITAMIN D3,54, Vit/Min/Prot/Unconv Diet(Human/Animal),61,year(s),F,"SINUS CONGESTION, INFLUENZA, SINUS TACHYCARDIA, DECREASED APPETITE, FEBRILE NEUTROPENIA, PYREXIA","Hospitalization, Patient Visited Healthcare Provider"
2018-CFS-000125,1/5/2018,,SUSPECT,EXEMPTION 4,53, Cosmetics,,,F,DEATH,Death
2018-CFS-000126,1/5/2018,2/22/2016,SUSPECT,EXEMPTION 4,53, Cosmetics,67,year(s),F,OVARIAN CANCER,"Hospitalization, Medically Important"
2018-CFS-000126,1/5/2018,2/22/2016,SUSPECT,EXEMPTION 4,53, Cosmetics,67,year(s),F,OVARIAN CANCER,"Hospitalization, Medically Important"
2018-CFS-000130,1/6/2018,10/11/2017,SUSPECT,WHOLE MILK,9, Milk/Butter/Dried Milk Prod,,,,"DIARRHOEA, NAUSEA, BODY TEMPERATURE FLUCTUATION","Patient Visited Healthcare Provider, Medically Important, Patient Visited ER"
2018-CFS-000131,1/6/2018,,SUSPECT,THREE BERRY BLEND (FROZEN),21, Fruit/Fruit Prod,,,,"VOMITING, NAUSEA",Medically Important
2018-CFS-000135,1/6/2018,,SUSPECT,Omega-3 fish oil gummies,54, Vit/Min/Prot/Unconv Diet(Human/Animal),,,,PYREXIA,Medically Important
2018-CFS-000137,1/6/2018,,SUSPECT,CHUNK LIGHT TUNA IN OIL,16, Fishery/Seafood Prod,,,,"DIARRHOEA, VOMITING",Medically Important
2018-CFS-000140,1/7/2018,1/3/2018,SUSPECT,TRUFIX,54, Vit/Min/Prot/Unconv Diet(Human/Animal),59,year(s),F,"HEART RATE IRREGULAR, RHEUMATOID ARTHRITIS","Medically Important, Other Seriousness"
2018-CFS-000140,1/7/2018,1/3/2018,SUSPECT,TRUCONTROL,54, Vit/Min/Prot/Unconv Diet(Human/Animal),59,year(s),F,"HEART RATE IRREGULAR, RHEUMATOID ARTHRITIS","Medically Important, Other Seriousness"
2018-CFS-000141,1/7/2018,12/25/2017,SUSPECT,HEARTS OF ROMAINE,24, Vegetables/Vegetable Products,,,,"NAUSEA, DIARRHOEA, HEADACHE, ABDOMINAL PAIN",Other Outcome
2018-CFS-000146,1/8/2018,8/30/2017,SUSPECT,EXEMPTION 4,53, Cosmetics,92,year(s),F,"DEATH, EXPOSURE TO CHEMICAL POLLUTION","Death, Hospitalization, Medically Important"
2018-CFS-000146,1/8/2018,8/30/2017,SUSPECT,EXEMPTION 4,53, Cosmetics,92,year(s),F,"DEATH, EXPOSURE TO CHEMICAL POLLUTION","Death, Hospitalization, Medically Important"
2018-CFS-000147,1/8/2018,,SUSPECT,EXEMPTION 4,53, Cosmetics,,,F,NEOPLASM MALIGNANT,Medically Important
2018-CFS-000148,1/8/2018,6/16/2017,SUSPECT,EXEMPTION 4,53, Cosmetics,83,year(s),F,"ENDOMETRIAL CANCER STAGE I, EXPOSURE TO CHEMICAL POLLUTION",Medically Important
2018-CFS-000148,1/8/2018,6/16/2017,SUSPECT,EXEMPTION 4,53, Cosmetics,83,year(s),F,"ENDOMETRIAL CANCER STAGE I, EXPOSURE TO CHEMICAL POLLUTION",Medically Important
2018-CFS-000149,1/8/2018,,SUSPECT,EXEMPTION 4,53, Cosmetics,,,F,OVARIAN CANCER,Medically Important
2018-CFS-000149,1/8/2018,,SUSPECT,EXEMPTION 4,53, Cosmetics,,,F,OVARIAN CANCER,Medically Important
2018-CFS-000150,1/8/2018,,SUSPECT,EXEMPTION 4,53, Cosmetics,40,year(s),F,OVARIAN CANCER,Medically Important
2018-CFS-000151,1/8/2018,,SUSPECT,EXEMPTION 4,53, Cosmetics,49,year(s),F,APPLICATION SITE SWELLING,Medically Important
2018-CFS-000152,1/8/2018,,SUSPECT,EXEMPTION 4,53, Cosmetics,,,M,EXPOSURE TO CHEMICAL POLLUTION,Medically Important
2018-CFS-000153,1/8/2018,11/28/2014,SUSPECT,EXEMPTION 4,53, Cosmetics,58,year(s),F,OVARIAN CANCER STAGE III,"Hospitalization, Medically Important"
2018-CFS-000153,1/8/2018,11/28/2014,SUSPECT,EXEMPTION 4,53, Cosmetics,58,year(s),F,OVARIAN CANCER STAGE III,"Hospitalization, Medically Important"
2018-CFS-000155,1/8/2018,12/20/2017,SUSPECT,OLAY SHOWER & BATH LIQUID BODY WASH,53, Cosmetics,,,M,"BLOOD URINE PRESENT, SKIN SWELLING, EYE SWELLING, RASH ERYTHEMATOUS, HAEMORRHAGE, HAEMOPTYSIS, SKIN BURNING SENSATION, POISONING, PAIN OF SKIN, RASH GENERALISED, DISCOMFORT, SWELLING FACE, OCULAR HYPERAEMIA, PAIN",Other Outcome
2018-CFS-000156,1/8/2018,12/24/2017,SUSPECT,MARKET PANTRY CHICKEN NUGGETS,17," Meat, Meat Products and Poultry",2,year(s),,VOMITING,Other Seriousness
2018-CFS-000157,1/8/2018,11/21/2017,SUSPECT,ORGANIC PEARS,20, Fruit/Fruit Prod,,,,LIP SWELLING,Disability
2018-CFS-000157,1/8/2018,11/21/2017,SUSPECT,ORGANIC APPLES,20, Fruit/Fruit Prod,,,,LIP SWELLING,Disability
2018-CFS-000158,1/8/2018,,SUSPECT,CITRACAL,54, Vit/Min/Prot/Unconv Diet(Human/Animal),78,year(s),M,"DYSPNOEA, FOREIGN BODY, OESOPHAGEAL IRRITATION",Other Outcome
2018-CFS-000159,1/8/2018,,SUSPECT,NATURE MADE MAGNESIUM CITRATE,54, Vit/Min/Prot/Unconv Diet(Human/Animal),90,year(s),M,"CHOKING, CYANOSIS, RETCHING, DYSPNOEA, FOREIGN BODY",Medically Important
2018-CFS-000160,1/8/2018,,SUSPECT,PRESERVISION AREDS 2,54, Vit/Min/Prot/Unconv Diet(Human/Animal),96,year(s),F,INTERNATIONAL NORMALISED RATIO INCREASED,Medically Important
2018-CFS-000160,1/8/2018,,CONCOMITANT,CENTRUM,54, Vit/Min/Prot/Unconv Diet(Human/Animal),96,year(s),F,INTERNATIONAL NORMALISED RATIO INCREASED,Medically Important
2018-CFS-000160,1/8/2018,,CONCOMITANT,VITAMIN D,54, Vit/Min/Prot/Unconv Diet(Human/Animal),96,year(s),F,INTERNATIONAL NORMALISED RATIO INCREASED,Medically Important
2018-CFS-000161,1/8/2018,,SUSPECT,OCUVITE ADULT 50+,54, Vit/Min/Prot/Unconv Diet(Human/Animal),87,year(s),M,"FOREIGN BODY, DYSPHAGIA",Medically Important
2018-CFS-000162,1/8/2018,,SUSPECT,CENTRUM SILVER,54, Vit/Min/Prot/Unconv Diet(Human/Animal),,,F,DIABETES MELLITUS,Medically Important
2018-CFS-000166,1/8/2018,,SUSPECT,CENTRUM SILVER,54, Vit/Min/Prot/Unconv Diet(Human/Animal),56,year(s),M,HAEMATOCHEZIA,Medically Important
2018-CFS-000167,1/8/2018,12/13/2012,SUSPECT,EXEMPTION 4,53, Cosmetics,51,year(s),F,"DEATH, OVARIAN CANCER STAGE III",Hospitalization
2018-CFS-000167,1/8/2018,12/13/2012,SUSPECT,EXEMPTION 4,53, Cosmetics,51,year(s),F,"DEATH, OVARIAN CANCER STAGE III",Hospitalization
2018-CFS-000168,1/8/2018,,SUSPECT,EXEMPTION 4,53, Cosmetics,61,year(s),F,OVARIAN CANCER,Medically Important
2018-CFS-000169,1/8/2018,,SUSPECT,EXEMPTION 4,53, Cosmetics,,,F,DEATH,Death