{"text_format":"1","workbook":"xlsx","n_sheets":2,"sheets":["algorithm","BAM tables"],"not_rendered":{"charts":0,"images":0,"macros":1,"external_links":0,"defined_names":17,"comments":1,"pivot_tables":0},"unopened":[],"bounds":{"document_bytes":16777216,"sheet_cells":100000,"rows_first":2000,"rows_last":500,"rows_between":2000,"halvings":0,"cell_chars":16384,"cell_head_chars":4096},"cells_cut":0,"cells_raw":0,"read":"whole","date_system":"1900"}

{"sheet":"algorithm","index":0,"n_rows":14,"n_cols":46,"rows_kept":14,"cut":false,"hidden":false,"merged":[[0,8,0,13],[1,14,1,20],[0,14,0,27],[1,21,1,27]]}
[null,null,null,null,null,null,null,null,"if only 3 dilutions from column F remain",null,null,null,null,null,"if more than 3 dilutions from column F remain"]
[null,null,null,null,null,null,null,null,null,null,null,null,null,null,"three remaining lowest dilutions to use if no dilution with all positive tubes",null,null,null,null,null,null,"three remaining highest dilutions to use if there is a dilution with all positive tubes"]
["dilution (g inocula)","# tubes showing positive growth"," # of tubes showing negative growth)","n (# of replicate tubes used in each dilution level)","does dilution and next lowest dilution both have 0 pos growth?","dilutions to use","dilution with all positive tubes","find the highest dilution with all positive tubes","1 dilution","2nd dilution","3rd dilution","# pos tubes to use for 1st dilution (lowest)","# pos tubes to use for 2nd (2nd lowest) dilution","# pos tubes to use for 3rd (lowest) dilution","lowest dilution to use","2ndlowest dilution to use","3rd lowest dilution to use","# pos tubes to use for lowest dilution","# pos tubes to use for 2nd lowest dilution","sum for # pos tubes for dilutions higher than 3rd lowest dilution","# pos tubes to use for 3rd lowest dilution","highest dilution to use","2nd highest dilution to use","3rd highest dilution to use","# pos tubes to use for 3rd highest dilution","# pos tubes to use for 2nd highest dilution","sum for # pos tubes for dilutions higher than highest dilution","# pos tubes to use for highest dilution","tentative final dilutions to use","# positive tubes corresponding to lowest dilutions","# positive tubes corresponding to 2nd lowest dilutions","# positive tubes corresponding to 3rd lowest dilutions","tentative final dilutions to use in order of increasing dilution","# positive tubes corresponding to final dilutions (in increasing order of dilution)","is # pos tube combination (colum AH) valid per table in BAM? (Yes=1,No=0)",null,"If column AJ=0 and do not wish to redo test use following dilutions:","final # positive tubes to use if column AK is filled in","is # pos tube combination (colum AL) valid per table in BAM? (Yes=1,No=0)",null,"If columns AI=0 and AM=0 then choose highest dilution with any positive tubes:","final # positive tubes to use if column AK is filled in",null,"final dilutions to use","final # pos tubes to use","Warning: Consider re-running the test if 'Yes' appears below (i.e. if outcome sufficiently improbable)"]
[10,4,{"$f":"D4-B4","v":1},5,{"$f":"IF(AND(IF(B4=0,1,0),IF(B4=0,1,0)),1,0)","v":0},{"$f":"IF(AND(IF(E4=1,1,0),IF(COUNT(A4)>=3,1,0)),\".\",A4)","v":10},{"$f":"IF(ISNUMBER(B4),IF(D4-B4=0,F4,999999))","v":999999},{"$f":"MIN($G$4:$G$11)","v":0.01},{"$f":"IF(COUNT($F$4:$F$11)=3,SMALL($F$4:$F$11,3),\".\")","v":"."},{"$f":"IF(COUNT($F$4:$F$11)=3,SMALL($F$4:$F$11,2),\".\")","v":"."},{"$f":"IF(COUNT($F$4:$F$11)=3,SMALL($F$4:$F$11,1),\".\")","v":"."},{"$f":"IF(AND(IF(F4<>\".\",1,0),IF(F4=I4,1,0)),B4,\".\")","v":"."},{"$f":"IF(AND(IF(F4<>\".\",1,0),IF(F4=J4,1,0)),B4,\".\")","v":"."},{"$f":"IF(AND(IF(F4<>\".\",1,0),IF(F4=K4,1,0)),B4,\".\")","v":"."},{"$f":"IF(COUNT($F$4:$F$11)>3,IF(AND(IF(H4=999999,1,0)),LARGE($F$4:$F$11,1),\".\"),\".\")","v":"."},{"$f":"IF(COUNT($F$4:$F$11)>3,IF(AND(IF(H4=999999,1,0)),LARGE($F$4:$F$11,2),\".\"),\".\")","v":"."},{"$f":"IF(COUNT($F$4:$F$11)>3,IF(AND(IF(H4=999999,1,0)),LARGE($F$4:$F$11,3),\".\"),\".\")","v":"."},{"$f":"IF(AND(IF(F4<>\".\",1,0),IF(F4=O4,1,0)),IF(O4=SMALL(O4:Q4,3),B4,\".\"),\".\")","v":"."},{"$f":"IF(AND(IF(F4<>\".\",1,0),IF(F4=P4,1,0)),IF(P4=SMALL(O4:Q4,2),B4,\".\"),\".\")","v":"."},{"$f":"IF(Q4<>\".\",IF(AND(IF(F4<=Q4,1,0),IF(Q4=SMALL(O4:Q4,1),1,0)),B4,\".\"),\".\")","v":"."},{"$f":"IF(Q4<>\".\",SUM($T$4:$T$11),\".\")","v":"."},{"$f":"IF(COUNT($F$4:$F$11)>3,IF(AND(IF(SMALL($F$4:$F$11,1)<=H4,1,0),IF(H4<=SMALL($F$4:$F$11,3),1,0)),SMALL($F$4:$F$11,1),H4/1000),\".\")","v":1E-3},{"$f":"IF(COUNT($F$4:$F$11)>3,IF(AND(IF(SMALL($F$4:$F$11,1)<=H4,1,0),IF(H4<=SMALL($F$4:$F$11,3),1,0)),SMALL($F$4:$F$11,2),H4/100),\".\")","v":0.01},{"$f":"IF(COUNT($F$4:$F$11)>3,IF(AND(IF(SMALL($F$4:$F$11,1)<=H4,1,0),IF(H4<=SMALL($F$4:$F$11,3),1,0)),SMALL($F$4:$F$11,3),H4/10),\".\")","v":0.1},{"$f":"IF(F4<>\".\",IF(F4=X4,IF(X4=SMALL(V4:X4,3),B4,\".\"),\".\"),\".\")","v":"."},{"$f":"IF(F4<>\".\",IF(F4=W4,IF(W4=SMALL(V4:X4,2),B4,\".\"),\".\"),\".\")","v":"."},{"$f":"IF(F4<>\".\",IF(AND(IF(V4<>\".\",1,0),IF(V4<MAX($A$4:$A$11),1,0),IF(F4<=V4,1,0),IF(V4=MIN(V4:X4),1,0)),B4,\".\"),\".\")","v":"."},{"$f":"IF(AND(IF(V4<>\".\",1,0),IF(V4<10,1,0)),SUM($AA$4:$AA$11),\".\")","v":1},{"$f":"MIN(I4,O4,V4)","v":1E-3},{"$f":"IF(AC4=LARGE($AC$4:$AC$6,1),IF(COUNT($L$4:$L$11,$R$4:$R$11,$Y$4:$Y$11),AVERAGE($L$4:$L$11,$R$4:$R$11,$Y$4:$Y$11),\".\"),\".\")","v":"."},{"$f":"IF(AC4=LARGE($AC$4:$AC$6,2),IF(COUNT($M$4:$M$11,$S$4:$S$11,$Z$4:$Z$11),AVERAGE($M$4:$M$11,$S$4:$S$11,$Z$4:$Z$11),\".\"),\".\")","v":"."},{"$f":"IF(AC4=LARGE($AC$4:$AC$6,3),IF(COUNT($N$4:$N$11,$U$4:$U$11,$AB$4:$AB$11),AVERAGE($N$4:$N$11,$U$4:$U$11,$AB$4:$AB$11),\".\"),\".\")","v":1},{"$f":"LARGE($AC$4:$AC$6,1)","v":0.1},{"$f":"IF(COUNT(AD4:AD6),AVERAGE(AD4:AD6),\".\")","v":4},{"$f":"MAX('BAM tables'!F2:F622)","v":1},null,{"$f":"IF($AI$4=0,SMALL($F$4:$F$11,3),\".\")","v":"."},{"$f":"IF(MAX(IF(AK4=$A$4,$B$4,-999999),IF(AK4=$A$5,$B$5,-999999),IF(AK4=$A$6,$B$6,-999999),IF(AK4=$A$7,$B$7,-999999),IF(AK4=$A$8,$B$8,-999999),IF(AK4=$A$9,$B$9,-999999),IF(AK4=$A$10,$B$10,-999999),IF(AK4=$A$11,$B$11,-999999))>=0,MAX(IF(AK4=$A$4,$B$4,-999999),IF(AK4=$A$5,$B$5,-999999),IF(AK4=$A$6,$B$6,-999999),IF(AK4=$A$7,$B$7,-999999),IF(AK4=$A$8,$B$8,-999999),IF(AK4=$A$9,$B$9,-999999),IF(AK4=$A$10,$B$10,-999999),IF(AK4=$A$11,$B$11,-999999)),\".\")","v":"."},{"$f":"MAX('BAM tables'!G2:G622)","v":0},null,{"$f":"IF(AND(IF(AI4=0,1,0),IF(AM4=0,1,0)),MIN(IF(B4>0,A4,999999),IF(B5>0,A5,999999),IF(B6>0,A6,999999),IF(B7>0,A7,999999),IF(B8>0,A8,999999),IF(B9>0,A9,999999),IF(B10>0,A10,999999),IF(B11>0,A11,999999)),\".\")","v":"."},{"$f":"IF(MAX(IF(AO4=$A$4,$B$4,0),IF(AO4=$A$5,$B$5,0),IF(AO4=$A$6,$B$6,0),IF(AO4=$A$7,$B$7,0),IF(AO4=$A$8,$B$8,0),IF(AO4=$A$9,$B$9,0),IF(AO4=$A$10,$B$10,0),IF(AO4=$A$11,$B$11,0))=0,\".\",MAX(IF(AO4=$A$4,$B$4,0),IF(AO4=$A$5,$B$5,0),IF(AO4=$A$6,$B$6,0),IF(AO4=$A$7,$B$7,0),IF(AO4=$A$8,$B$8,0),IF(AO4=$A$9,$B$9,0),IF(AO4=$A$10,$B$10,0),IF(AO4=$A$11,$B$11,0)))","v":"."},null,{"$f":"IF($AO$4=\".\",IF($AM$4=0,IF($AI$4=1,AG4),AK4),$AO$4)","v":0.1},{"$f":"IF($AP$4=\".\",IF($AM$4=0,IF($AI$4=1,AH4),AL4),$AP$4)","v":4},{"$f":"IF(AI4=0,\"Yes\",\"No\")","v":"No"}]
[{"$f":"A4/10","v":1},5,{"$f":"D5-B5","v":0},5,{"$f":"IF(AND(IF(B5=0,1,0),IF(B4=0,1,0)),1,0)","v":0},{"$f":"IF(AND(IF(E5=1,1,0),IF(COUNT(A4)>=3,1,0)),\".\",A5)","v":1},1,0.01,{"$f":"IF(COUNT($F$4:$F$11)=3,SMALL($F$4:$F$11,3),\".\")","v":"."},{"$f":"IF(COUNT($F$4:$F$11)=3,SMALL($F$4:$F$11,2),\".\")","v":"."},{"$f":"IF(COUNT($F$4:$F$11)=3,SMALL($F$4:$F$11,1),\".\")","v":"."},".",{"$f":"IF(AND(IF(F5<>\".\",1,0),IF(F5=J5,1,0)),B5,\".\")","v":"."},{"$f":"IF(AND(IF(F5<>\".\",1,0),IF(F5=K5,1,0)),B5,\".\")","v":"."},{"$f":"IF(COUNT($F$4:$F$11)>3,IF(AND(IF(H5=999999,1,0)),LARGE($F$4:$F$11,1),\".\"),\".\")","v":"."},{"$f":"IF(COUNT($F$4:$F$11)>3,IF(AND(IF(H5=999999,1,0)),LARGE($F$4:$F$11,2),\".\"),\".\")","v":"."},{"$f":"IF(COUNT($F$4:$F$11)>3,IF(AND(IF(H5=999999,1,0)),LARGE($F$4:$F$11,3),\".\"),\".\")","v":"."},".",".",".",{"$f":"IF(Q5<>\".\",SUM($T$4:$T$11),\".\")","v":"."},1E-3,0.01,0.1,".",".",{"$f":"IF(F5<>\".\",IF(AND(IF(V5<>\".\",1,0),IF(V5<MAX($A$4:$A$11),1,0),IF(F5<=V5,1,0),IF(V5=MIN(V5:X5),1,0)),B5,\".\"),\".\")","v":"."},{"$f":"IF(AND(IF(V5<>\".\",1,0),IF(V5<10,1,0)),SUM($AA$4:$AA$11),\".\")","v":1},{"$f":"MIN(J4,P4,W4)","v":0.01},{"$f":"IF(AC5=LARGE($AC$4:$AC$6,1),IF(COUNT($L$4:$L$11,$R$4:$R$11,$Y$4:$Y$11),AVERAGE($L$4:$L$11,$R$4:$R$11,$Y$4:$Y$11),\".\"),\".\")","v":"."},{"$f":"IF(AC5=LARGE($AC$4:$AC$6,2),IF(COUNT($M$4:$M$11,$S$4:$S$11,$Z$4:$Z$11),AVERAGE($M$4:$M$11,$S$4:$S$11,$Z$4:$Z$11),\".\"),\".\")","v":5},{"$f":"IF(AC5=LARGE($AC$4:$AC$6,3),IF(COUNT($N$4:$N$11,$U$4:$U$11,$AB$4:$AB$11),AVERAGE($N$4:$N$11,$U$4:$U$11,$AB$4:$AB$11),\".\"),\".\")","v":"."},{"$f":"LARGE($AC$4:$AC$6,2)","v":0.01},{"$f":"IF(COUNT(AE4:AE6),AVERAGE(AE4:AE6),\".\")","v":5},null,null,{"$f":"IF($AI$4=0,SMALL($F$4:$F$11,2),\".\")","v":"."},{"$f":"IF(MAX(IF(AK5=$A$4,$B$4,-999999),IF(AK5=$A$5,$B$5,-999999),IF(AK5=$A$6,$B$6,-999999),IF(AK5=$A$7,$B$7,-999999),IF(AK5=$A$8,$B$8,-999999),IF(AK5=$A$9,$B$9,-999999),IF(AK5=$A$10,$B$10,-999999),IF(AK5=$A$11,$B$11,-999999))>=0,MAX(IF(AK5=$A$4,$B$4,-999999),IF(AK5=$A$5,$B$5,-999999),IF(AK5=$A$6,$B$6,-999999),IF(AK5=$A$7,$B$7,-999999),IF(AK5=$A$8,$B$8,-999999),IF(AK5=$A$9,$B$9,-999999),IF(AK5=$A$10,$B$10,-999999),IF(AK5=$A$11,$B$11,-999999)),\".\")","v":"."},null,null,null,null,null,{"$f":"IF($AO$4=\".\",IF($AM$4=0,IF($AI$4=1,AG5),AK5),$AO$4)","v":0.01},{"$f":"IF($AP$4=\".\",IF($AM$4=0,IF($AI$4=1,AH5),AL5),$AP$4)","v":5}]
[{"$f":"A5/10","v":0.1},4,{"$f":"D6-B6","v":1},5,0,{"$f":"IF(AND(IF(E6=1,1,0),IF(COUNT(A4:A5)>=3,1,0)),\".\",A6)","v":0.1},999999,0.01,".",".",".",".",".",".",".",".",".",".",".",".",".",1E-3,0.01,0.1,4,".",".",1,{"$f":"MIN(K4,Q4,X4)","v":0.1},4,{"$f":"IF(AC6=LARGE($AC$4:$AC$6,2),IF(COUNT($M$4:$M$11,$S$4:$S$11,$Z$4:$Z$11),AVERAGE($M$4:$M$11,$S$4:$S$11,$Z$4:$Z$11),\".\"),\".\")","v":"."},{"$f":"IF(AC6=LARGE($AC$4:$AC$6,3),IF(COUNT($N$4:$N$11,$U$4:$U$11,$AB$4:$AB$11),AVERAGE($N$4:$N$11,$U$4:$U$11,$AB$4:$AB$11),\".\"),\".\")","v":"."},{"$f":"LARGE($AC$4:$AC$6,3)","v":1E-3},{"$f":"IF(COUNT(AF4:AF6),AVERAGE(AF4:AF6),\".\")","v":1},null,null,{"$f":"IF($AI$4=0,SMALL($F$4:$F$11,1),\".\")","v":"."},{"$f":"IF(MAX(IF(AK6=$A$4,$B$4,-999999),IF(AK6=$A$5,$B$5,-999999),IF(AK6=$A$6,$B$6,-999999),IF(AK6=$A$7,$B$7,-999999),IF(AK6=$A$8,$B$8,-999999),IF(AK6=$A$9,$B$9,-999999),IF(AK6=$A$10,$B$10,-999999),IF(AK6=$A$11,$B$11,-999999))>=0,MAX(IF(AK6=$A$4,$B$4,-999999),IF(AK6=$A$5,$B$5,-999999),IF(AK6=$A$6,$B$6,-999999),IF(AK6=$A$7,$B$7,-999999),IF(AK6=$A$8,$B$8,-999999),IF(AK6=$A$9,$B$9,-999999),IF(AK6=$A$10,$B$10,-999999),IF(AK6=$A$11,$B$11,-999999)),\".\")","v":"."},null,null,null,null,null,{"$f":"IF($AO$4=\".\",IF($AM$4=0,IF($AI$4=1,AG6),AK6),$AO$4)","v":1E-3},{"$f":"IF($AP$4=\".\",IF($AM$4=0,IF($AI$4=1,AH6),AL6),$AP$4)","v":1}]
[{"$f":"A6/10","v":0.01},5,{"$f":"D7-B7","v":0},5,0,{"$f":"IF(AND(IF(E7=1,1,0),IF(COUNT(A4:A6)>=3,1,0)),\".\",A7)","v":0.01},0.01,0.01,".",".",".",".",".",".",".",".",".",".",".",".",".",1E-3,0.01,0.1,".",5,".",1]
[{"$f":"A7/10","v":1E-3},1,{"$f":"D8-B8","v":4},5,0,{"$f":"IF(AND(IF(E8=1,1,0),IF(COUNT(A4:A7)>=3,1,0)),\".\",A8)","v":1E-3},999999,0.01,".",".",".",".",".",".",".",".",".",".",".",".",".",1E-3,0.01,0.1,".",".",1,1]
[".",".",".",5,0,{"$f":"IF(AND(IF(E9=1,1,0),IF(COUNT(A4:A8)>=3,1,0)),\".\",A9)","v":"."},false,0.01,".",".",".",".",".",".",".",".",".",".",".",".",".",1E-3,0.01,0.1,".",".",".",1,null,"."]
[".",".",".",5,0,{"$f":"IF(AND(IF(E10=1,1,0),IF(COUNT(A4:A9)>=3,1,0)),\".\",A10)","v":"."},false,0.01,".",".",".",".",".",".",".",".",".",".",".",".",".",1E-3,0.01,0.1,".",".",".",1,null,"."]
[".",".",".",5,0,{"$f":"IF(AND(IF(E11=1,1,0),IF(COUNT(A4:A10)>=3,1,0)),\".\",A11)","v":"."},false,0.01,".",".",".",".",".",".",".",".",".",".",".",".",".",1E-3,0.01,0.1,".",".",".",1,null,"."]
[]
[]
["Note: enter \".\" in columns A, B & C for missing cells. Example, if only have five diluions, enter \".\" for cells A9-A11, B9-B11 and C9-C11."]

{"sheet":"BAM tables","index":1,"n_rows":622,"n_cols":7,"rows_kept":622,"cut":false,"hidden":true,"merged":[[0,5,0,6]]}
["pos tubes 1","pos tubes 2","pos tubes 3","number tubes"]
[0,0,0,5,null,{"$f":"IF(AND(IF(algorithm!$D$4='BAM tables'!D2,1,0),IF(algorithm!$AH$4='BAM tables'!A2,1,0),IF(algorithm!$AH$5='BAM tables'!B2,1,0),IF(algorithm!$AH$6='BAM tables'!C2,1,0)),1,0)","v":0},{"$f":"IF(AND(IF(algorithm!$D$4='BAM tables'!D2,1,0),IF(algorithm!$AL$4='BAM tables'!A2,1,0),IF(algorithm!$AL$5='BAM tables'!B2,1,0),IF(algorithm!$AL$6='BAM tables'!C2,1,0)),1,0)","v":0}]
[0,0,0,3,null,{"$f":"IF(AND(IF(algorithm!$D$4='BAM tables'!D3,1,0),IF(algorithm!$AH$4='BAM tables'!A3,1,0),IF(algorithm!$AH$5='BAM tables'!B3,1,0),IF(algorithm!$AH$6='BAM tables'!C3,1,0)),1,0)","v":0},{"$f":"IF(AND(IF(algorithm!$D$4='BAM tables'!D3,1,0),IF(algorithm!$AL$4='BAM tables'!A3,1,0),IF(algorithm!$AL$5='BAM tables'!B3,1,0),IF(algorithm!$AL$6='BAM tables'!C3,1,0)),1,0)","v":0}]
[0,0,0,8,null,{"$f":"IF(AND(IF(algorithm!$D$4='BAM tables'!D4,1,0),IF(algorithm!$AH$4='BAM tables'!A4,1,0),IF(algorithm!$AH$5='BAM tables'!B4,1,0),IF(algorithm!$AH$6='BAM tables'!C4,1,0)),1,0)","v":0},{"$f":"IF(AND(IF(algorithm!$D$4='BAM tables'!D4,1,0),IF(algorithm!$AL$4='BAM tables'!A4,1,0),IF(algorithm!$AL$5='BAM tables'!B4,1,0),IF(algorithm!$AL$6='BAM tables'!C4,1,0)),1,0)","v":0}]
[0,0,0,10,null,{"$f":"IF(AND(IF(algorithm!$D$4='BAM tables'!D5,1,0),IF(algorithm!$AH$4='BAM tables'!A5,1,0),IF(algorithm!$AH$5='BAM tables'!B5,1,0),IF(algorithm!$AH$6='BAM tables'!C5,1,0)),1,0)","v":0},{"$f":"IF(AND(IF(algorithm!$D$4='BAM tables'!D5,1,0),IF(algorithm!$AL$4='BAM tables'!A5,1,0),IF(algorithm!$AL$5='BAM tables'!B5,1,0),IF(algorithm!$AL$6='BAM tables'!C5,1,0)),1,0)","v":0}]
[0,0,1,5,null,{"$f":"IF(AND(IF(algorithm!$D$4='BAM tables'!D6,1,0),IF(algorithm!$AH$4='BAM tables'!A6,1,0),IF(algorithm!$AH$5='BAM tables'!B6,1,0),IF(algorithm!$AH$6='BAM tables'!C6,1,0)),1,0)","v":0},{"$f":"IF(AND(IF(algorithm!$D$4='BAM tables'!D6,1,0),IF(algorithm!$AL$4='BAM tables'!A6,1,0),IF(algorithm!$AL$5='BAM tables'!B6,1,0),IF(algorithm!$AL$6='BAM tables'!C6,1,0)),1,0)","v":0}]
[0,0,1,3,null,{"$f":"IF(AND(IF(algorithm!$D$4='BAM tables'!D7,1,0),IF(algorithm!$AH$4='BAM tables'!A7,1,0),IF(algorithm!$AH$5='BAM tables'!B7,1,0),IF(algorithm!$AH$6='BAM tables'!C7,1,0)),1,0)","v":0},{"$f":"IF(AND(IF(algorithm!$D$4='BAM tables'!D7,1,0),IF(algorithm!$AL$4='BAM tables'!A7,1,0),IF(algorithm!$AL$5='BAM tables'!B7,1,0),IF(algorithm!$AL$6='BAM tables'!C7,1,0)),1,0)","v":0}]
[0,0,1,8,null,{"$f":"IF(AND(IF(algorithm!$D$4='BAM tables'!D8,1,0),IF(algorithm!$AH$4='BAM tables'!A8,1,0),IF(algorithm!$AH$5='BAM tables'!B8,1,0),IF(algorithm!$AH$6='BAM tables'!C8,1,0)),1,0)","v":0},{"$f":"IF(AND(IF(algorithm!$D$4='BAM tables'!D8,1,0),IF(algorithm!$AL$4='BAM tables'!A8,1,0),IF(algorithm!$AL$5='BAM tables'!B8,1,0),IF(algorithm!$AL$6='BAM tables'!C8,1,0)),1,0)","v":0}]
[0,0,1,10,null,{"$f":"IF(AND(IF(algorithm!$D$4='BAM tables'!D9,1,0),IF(algorithm!$AH$4='BAM tables'!A9,1,0),IF(algorithm!$AH$5='BAM tables'!B9,1,0),IF(algorithm!$AH$6='BAM tables'!C9,1,0)),1,0)","v":0},{"$f":"IF(AND(IF(algorithm!$D$4='BAM tables'!D9,1,0),IF(algorithm!$AL$4='BAM tables'!A9,1,0),IF(algorithm!$AL$5='BAM tables'!B9,1,0),IF(algorithm!$AL$6='BAM tables'!C9,1,0)),1,0)","v":0}]
[0,0,2,8,null,{"$f":"IF(AND(IF(algorithm!$D$4='BAM tables'!D10,1,0),IF(algorithm!$AH$4='BAM tables'!A10,1,0),IF(algorithm!$AH$5='BAM tables'!B10,1,0),IF(algorithm!$AH$6='BAM tables'!C10,1,0)),1,0)","v":0},{"$f":"IF(AND(IF(algorithm!$D$4='BAM tables'!D10,1,0),IF(algorithm!$AL$4='BAM tables'!A10,1,0),IF(algorithm!$AL$5='BAM tables'!B10,1,0),IF(algorithm!$AL$6='BAM tables'!C10,1,0)),1,0)","v":0}]
[0,0,2,10,null,{"$f":"IF(AND(IF(algorithm!$D$4='BAM tables'!D11,1,0),IF(algorithm!$AH$4='BAM tables'!A11,1,0),IF(algorithm!$AH$5='BAM tables'!B11,1,0),IF(algorithm!$AH$6='BAM tables'!C11,1,0)),1,0)","v":0},{"$f":"IF(AND(IF(algorithm!$D$4='BAM tables'!D11,1,0),IF(algorithm!$AL$4='BAM tables'!A11,1,0),IF(algorithm!$AL$5='BAM tables'!B11,1,0),IF(algorithm!$AL$6='BAM tables'!C11,1,0)),1,0)","v":0}]
[0,1,0,5,null,{"$f":"IF(AND(IF(algorithm!$D$4='BAM tables'!D12,1,0),IF(algorithm!$AH$4='BAM tables'!A12,1,0),IF(algorithm!$AH$5='BAM tables'!B12,1,0),IF(algorithm!$AH$6='BAM tables'!C12,1,0)),1,0)","v":0},{"$f":"IF(AND(IF(algorithm!$D$4='BAM tables'!D12,1,0),IF(algorithm!$AL$4='BAM tables'!A12,1,0),IF(algorithm!$AL$5='BAM tables'!B12,1,0),IF(algorithm!$AL$6='BAM tables'!C12,1,0)),1,0)","v":0}]
[0,1,0,3,null,{"$f":"IF(AND(IF(algorithm!$D$4='BAM tables'!D13,1,0),IF(algorithm!$AH$4='BAM tables'!A13,1,0),IF(algorithm!$AH$5='BAM tables'!B13,1,0),IF(algorithm!$AH$6='BAM tables'!C13,1,0)),1,0)","v":0},{"$f":"IF(AND(IF(algorithm!$D$4='BAM tables'!D13,1,0),IF(algorithm!$AL$4='BAM tables'!A13,1,0),IF(algorithm!$AL$5='BAM tables'!B13,1,0),IF(algorithm!$AL$6='BAM tables'!C13,1,0)),1,0)","v":0}]
[0,1,0,8,null,{"$f":"IF(AND(IF(algorithm!$D$4='BAM tables'!D14,1,0),IF(algorithm!$AH$4='BAM tables'!A14,1,0),IF(algorithm!$AH$5='BAM tables'!B14,1,0),IF(algorithm!$AH$6='BAM tables'!C14,1,0)),1,0)","v":0},{"$f":"IF(AND(IF(algorithm!$D$4='BAM tables'!D14,1,0),IF(algorithm!$AL$4='BAM tables'!A14,1,0),IF(algorithm!$AL$5='BAM tables'!B14,1,0),IF(algorithm!$AL$6='BAM tables'!C14,1,0)),1,0)","v":0}]
[0,1,0,10,null,{"$f":"IF(AND(IF(algorithm!$D$4='BAM tables'!D15,1,0),IF(algorithm!$AH$4='BAM tables'!A15,1,0),IF(algorithm!$AH$5='BAM tables'!B15,1,0),IF(algorithm!$AH$6='BAM tables'!C15,1,0)),1,0)","v":0},{"$f":"IF(AND(IF(algorithm!$D$4='BAM tables'!D15,1,0),IF(algorithm!$AL$4='BAM tables'!A15,1,0),IF(algorithm!$AL$5='BAM tables'!B15,1,0),IF(algorithm!$AL$6='BAM tables'!C15,1,0)),1,0)","v":0}]
[0,1,1,5,null,{"$f":"IF(AND(IF(algorithm!$D$4='BAM tables'!D16,1,0),IF(algorithm!$AH$4='BAM tables'!A16,1,0),IF(algorithm!$AH$5='BAM tables'!B16,1,0),IF(algorithm!$AH$6='BAM tables'!C16,1,0)),1,0)","v":0},{"$f":"IF(AND(IF(algorithm!$D$4='BAM tables'!D16,1,0),IF(algorithm!$AL$4='BAM tables'!A16,1,0),IF(algorithm!$AL$5='BAM tables'!B16,1,0),IF(algorithm!$AL$6='BAM tables'!C16,1,0)),1,0)","v":0}]
[0,1,1,3,null,{"$f":"IF(AND(IF(algorithm!$D$4='BAM tables'!D17,1,0),IF(algorithm!$AH$4='BAM tables'!A17,1,0),IF(algorithm!$AH$5='BAM tables'!B17,1,0),IF(algorithm!$AH$6='BAM tables'!C17,1,0)),1,0)","v":0},{"$f":"IF(AND(IF(algorithm!$D$4='BAM tables'!D17,1,0),IF(algorithm!$AL$4='BAM tables'!A17,1,0),IF(algorithm!$AL$5='BAM tables'!B17,1,0),IF(algorithm!$AL$6='BAM tables'!C17,1,0)),1,0)","v":0}]
[0,1,1,8,null,{"$f":"IF(AND(IF(algorithm!$D$4='BAM tables'!D18,1,0),IF(algorithm!$AH$4='BAM tables'!A18,1,0),IF(algorithm!$AH$5='BAM tables'!B18,1,0),IF(algorithm!$AH$6='BAM tables'!C18,1,0)),1,0)","v":0},{"$f":"IF(AND(IF(algorithm!$D$4='BAM tables'!D18,1,0),IF(algorithm!$AL$4='BAM tables'!A18,1,0),IF(algorithm!$AL$5='BAM tables'!B18,1,0),IF(algorithm!$AL$6='BAM tables'!C18,1,0)),1,0)","v":0}]
[0,1,1,10,null,{"$f":"IF(AND(IF(algorithm!$D$4='BAM tables'!D19,1,0),IF(algorithm!$AH$4='BAM tables'!A19,1,0),IF(algorithm!$AH$5='BAM tables'!B19,1,0),IF(algorithm!$AH$6='BAM tables'!C19,1,0)),1,0)","v":0},{"$f":"IF(AND(IF(algorithm!$D$4='BAM tables'!D19,1,0),IF(algorithm!$AL$4='BAM tables'!A19,1,0),IF(algorithm!$AL$5='BAM tables'!B19,1,0),IF(algorithm!$AL$6='BAM tables'!C19,1,0)),1,0)","v":0}]
[0,2,0,5,null,{"$f":"IF(AND(IF(algorithm!$D$4='BAM tables'!D20,1,0),IF(algorithm!$AH$4='BAM tables'!A20,1,0),IF(algorithm!$AH$5='BAM tables'!B20,1,0),IF(algorithm!$AH$6='BAM tables'!C20,1,0)),1,0)","v":0},{"$f":"IF(AND(IF(algorithm!$D$4='BAM tables'!D20,1,0),IF(algorithm!$AL$4='BAM tables'!A20,1,0),IF(algorithm!$AL$5='BAM tables'!B20,1,0),IF(algorithm!$AL$6='BAM tables'!C20,1,0)),1,0)","v":0}]
[0,2,0,3,null,{"$f":"IF(AND(IF(algorithm!$D$4='BAM tables'!D21,1,0),IF(algorithm!$AH$4='BAM tables'!A21,1,0),IF(algorithm!$AH$5='BAM tables'!B21,1,0),IF(algorithm!$AH$6='BAM tables'!C21,1,0)),1,0)","v":0},{"$f":"IF(AND(IF(algorithm!$D$4='BAM tables'!D21,1,0),IF(algorithm!$AL$4='BAM tables'!A21,1,0),IF(algorithm!$AL$5='BAM tables'!B21,1,0),IF(algorithm!$AL$6='BAM tables'!C21,1,0)),1,0)","v":0}]
[0,2,0,8,null,{"$f":"IF(AND(IF(algorithm!$D$4='BAM tables'!D22,1,0),IF(algorithm!$AH$4='BAM tables'!A22,1,0),IF(algorithm!$AH$5='BAM tables'!B22,1,0),IF(algorithm!$AH$6='BAM tables'!C22,1,0)),1,0)","v":0},{"$f":"IF(AND(IF(algorithm!$D$4='BAM tables'!D22,1,0),IF(algorithm!$AL$4='BAM tables'!A22,1,0),IF(algorithm!$AL$5='BAM tables'!B22,1,0),IF(algorithm!$AL$6='BAM tables'!C22,1,0)),1,0)","v":0}]
[0,2,0,10,null,{"$f":"IF(AND(IF(algorithm!$D$4='BAM tables'!D23,1,0),IF(algorithm!$AH$4='BAM tables'!A23,1,0),IF(algorithm!$AH$5='BAM tables'!B23,1,0),IF(algorithm!$AH$6='BAM tables'!C23,1,0)),1,0)","v":0},{"$f":"IF(AND(IF(algorithm!$D$4='BAM tables'!D23,1,0),IF(algorithm!$AL$4='BAM tables'!A23,1,0),IF(algorithm!$AL$5='BAM tables'!B23,1,0),IF(algorithm!$AL$6='BAM tables'!C23,1,0)),1,0)","v":0}]
[0,2,1,5,null,{"$f":"IF(AND(IF(algorithm!$D$4='BAM tables'!D24,1,0),IF(algorithm!$AH$4='BAM tables'!A24,1,0),IF(algorithm!$AH$5='BAM tables'!B24,1,0),IF(algorithm!$AH$6='BAM tables'!C24,1,0)),1,0)","v":0},{"$f":"IF(AND(IF(algorithm!$D$4='BAM tables'!D24,1,0),IF(algorithm!$AL$4='BAM tables'!A24,1,0),IF(algorithm!$AL$5='BAM tables'!B24,1,0),IF(algorithm!$AL$6='BAM tables'!C24,1,0)),1,0)","v":0}]
[0,2,1,8,null,{"$f":"IF(AND(IF(algorithm!$D$4='BAM tables'!D25,1,0),IF(algorithm!$AH$4='BAM tables'!A25,1,0),IF(algorithm!$AH$5='BAM tables'!B25,1,0),IF(algorithm!$AH$6='BAM tables'!C25,1,0)),1,0)","v":0},{"$f":"IF(AND(IF(algorithm!$D$4='BAM tables'!D25,1,0),IF(algorithm!$AL$4='BAM tables'!A25,1,0),IF(algorithm!$AL$5='BAM tables'!B25,1,0),IF(algorithm!$AL$6='BAM tables'!C25,1,0)),1,0)","v":0}]
[0,2,1,10,null,{"$f":"IF(AND(IF(algorithm!$D$4='BAM tables'!D26,1,0),IF(algorithm!$AH$4='BAM tables'!A26,1,0),IF(algorithm!$AH$5='BAM tables'!B26,1,0),IF(algorithm!$AH$6='BAM tables'!C26,1,0)),1,0)","v":0},{"$f":"IF(AND(IF(algorithm!$D$4='BAM tables'!D26,1,0),IF(algorithm!$AL$4='BAM tables'!A26,1,0),IF(algorithm!$AL$5='BAM tables'!B26,1,0),IF(algorithm!$AL$6='BAM tables'!C26,1,0)),1,0)","v":0}]
[0,3,0,5,null,{"$f":"IF(AND(IF(algorithm!$D$4='BAM tables'!D27,1,0),IF(algorithm!$AH$4='BAM tables'!A27,1,0),IF(algorithm!$AH$5='BAM tables'!B27,1,0),IF(algorithm!$AH$6='BAM tables'!C27,1,0)),1,0)","v":0},{"$f":"IF(AND(IF(algorithm!$D$4='BAM tables'!D27,1,0),IF(algorithm!$AL$4='BAM tables'!A27,1,0),IF(algorithm!$AL$5='BAM tables'!B27,1,0),IF(algorithm!$AL$6='BAM tables'!C27,1,0)),1,0)","v":0}]
[0,3,0,3,null,{"$f":"IF(AND(IF(algorithm!$D$4='BAM tables'!D28,1,0),IF(algorithm!$AH$4='BAM tables'!A28,1,0),IF(algorithm!$AH$5='BAM tables'!B28,1,0),IF(algorithm!$AH$6='BAM tables'!C28,1,0)),1,0)","v":0},{"$f":"IF(AND(IF(algorithm!$D$4='BAM tables'!D28,1,0),IF(algorithm!$AL$4='BAM tables'!A28,1,0),IF(algorithm!$AL$5='BAM tables'!B28,1,0),IF(algorithm!$AL$6='BAM tables'!C28,1,0)),1,0)","v":0}]
[0,3,0,8,null,{"$f":"IF(AND(IF(algorithm!$D$4='BAM tables'!D29,1,0),IF(algorithm!$AH$4='BAM tables'!A29,1,0),IF(algorithm!$AH$5='BAM tables'!B29,1,0),IF(algorithm!$AH$6='BAM tables'!C29,1,0)),1,0)","v":0},{"$f":"IF(AND(IF(algorithm!$D$4='BAM tables'!D29,1,0),IF(algorithm!$AL$4='BAM tables'!A29,1,0),IF(algorithm!$AL$5='BAM tables'!B29,1,0),IF(algorithm!$AL$6='BAM tables'!C29,1,0)),1,0)","v":0}]
[0,3,0,10,null,{"$f":"IF(AND(IF(algorithm!$D$4='BAM tables'!D30,1,0),IF(algorithm!$AH$4='BAM tables'!A30,1,0),IF(algorithm!$AH$5='BAM tables'!B30,1,0),IF(algorithm!$AH$6='BAM tables'!C30,1,0)),1,0)","v":0},{"$f":"IF(AND(IF(algorithm!$D$4='BAM tables'!D30,1,0),IF(algorithm!$AL$4='BAM tables'!A30,1,0),IF(algorithm!$AL$5='BAM tables'!B30,1,0),IF(algorithm!$AL$6='BAM tables'!C30,1,0)),1,0)","v":0}]
{"$rows_left_out":592}