Report ID,CAERS Created Date,Date of Event,Product Type,Product,Product Code,Description,Patient Age,Age Units,Sex,Medra Preferred Terms,Outcomes
172934,1/1/2014,12/5/2013,SUSPECT,VALUED NATIONAL PINE NUTS,23, Nuts/Edible Seed,,,,"DYSGEUSIA, HYPERSENSITIVITY",Other Outcome
172937,1/1/2014,,SUSPECT,"DAVID'S SUNFLOWER SEEDS, RANCH FLAVORED",23, Nuts/Edible Seed,,,,"PAIN, MUCOSAL ULCERATION, TENDERNESS, BURNING SENSATION, CAUSTIC INJURY","Hospitalization, Patient Visited Healthcare Provider, "
172939,1/1/2014,,SUSPECT,"KASHI WHOLE WHEAT BISCUITS, ISLAND VANILLA",5,Cereal Prep/Breakfast Food,,,,"VOMITING, ABDOMINAL PAIN, FEELING OF BODY TEMPERATURE CHANGE, FLUSHING, DYSPEPSIA, BODY TEMPERATURE INCREASED, GASTROINTESTINAL DISORDER, FEELING HOT, MALAISE",Other Outcome
172940,1/1/2014,,SUSPECT,DANNON DANNON LITE & FIT GREEK YOGURT CHERRY,9,Milk/Butter/Dried Milk Prod,,,,NAUSEA,Other Outcome
172941,1/1/2014,12/16/2013,SUSPECT,COPPER RIVER KIPPERED ALASKA SILVER SALMON,16,Fishery/Seafood Prod,,,,LACERATION,Other Outcome
172944,1/1/2014,,SUSPECT,"WELCH'S 100% GRAPE JUICE, FROM CONCENTRATE WITH ADDED VITAMIN C",20,Fruit/Fruit Prod,,,,"SALIVARY GLAND DISORDER, ANXIETY, SLEEP DISORDER",Other Outcome
172945,1/1/2014,,SUSPECT,SAVORITZ ORIGINAL BUTTERY ROUND CRACKERS,3, Bakery Prod/Dough/Mix/Icing,,,,VOMITING,Other Outcome
172947,1/2/2014,,CONCOMITANT,FISH OIL (FISH OIL),54, Vit/Min/Prot/Unconv Diet(Human/Animal),64,year(s),F,"FOREIGN BODY TRAUMA, CHOKING","Medically Important, "
172947,1/2/2014,,CONCOMITANT,VITAMIN C (ASCORBIC ACID),54, Vit/Min/Prot/Unconv Diet(Human/Animal),64,year(s),F,"FOREIGN BODY TRAUMA, CHOKING","Medically Important, "
172947,1/2/2014,,SUSPECT,CITRACAL MAXIMUM (CHOLECALCIFEROL + CALCLIUM CITRATE) FILM-COATED TABLET,54, Vit/Min/Prot/Unconv Diet(Human/Animal),64,year(s),F,"FOREIGN BODY TRAUMA, CHOKING","Medically Important, "
172948,1/2/2014,12/4/2013,SUSPECT,"CENTRUM SILVER WOMEN'S 50+ (MULTIMINERALS, MULTIVITAMINS) TABLET",54, Vit/Min/Prot/Unconv Diet(Human/Animal),,,,"CHOKING, CHEST DISCOMFORT, FEELING ABNORMAL, VOMITING","Medically Important, "
172949,1/2/2014,,SUSPECT,"CENTRUM SILVER (MULTIMINERALS, MULTIVITAMINS)",54, Vit/Min/Prot/Unconv Diet(Human/Animal),69,year(s),F,"ABDOMINAL PAIN, DYSURIA, DYSPNOEA, MUSCULAR WEAKNESS, HEADACHE, COLITIS, VULVOVAGINAL DISCOMFORT, VULVOVAGINAL BURNING SENSATION, DIZZINESS","Patient Visited Healthcare Provider, Medically Important, "
172950,1/2/2014,,SUSPECT,"CENTRUM ULTRA WOMEN'S (MULTIMINERALS, MULTIVITAMINS) TABLET",54, Vit/Min/Prot/Unconv Diet(Human/Animal),,,,"CHOKING, THROAT IRRITATION","Medically Important, "
172951,1/2/2014,,SUSPECT,"CENTRUM SILVER WOMEN'S 50+ (MULTIMINERALS, MULTIVITAMINS) TABLET",54, Vit/Min/Prot/Unconv Diet(Human/Animal),,,,"CHOKING, DYSPHAGIA","Medically Important, "
172952,1/2/2014,11/27/2013,SUSPECT,"CENTRUM SILVER WOMEN'S 50+ (MULTIMINERALS, MULTIVITAMINS) TABLET",54, Vit/Min/Prot/Unconv Diet(Human/Animal),62,year(s),F,"CHOKING, DYSPHAGIA, CHOKING SENSATION, ANXIETY, FOREIGN BODY TRAUMA","Medically Important, "
172953,1/2/2014,,SUSPECT,"CENTRUM SILVER WOMEN'S 50+ (MULTIMINERALS, MULTIVITAMINS)TABLET",54, Vit/Min/Prot/Unconv Diet(Human/Animal),70,year(s),F,CHOKING,"Medically Important, "
172954,1/2/2014,,SUSPECT,"CENTRUM SILVER WOMEN'S 50+ (MULTIMINERALS, MULTIVITAMINS) TABLET",54, Vit/Min/Prot/Unconv Diet(Human/Animal),70,year(s),F,"PAIN, DYSPHAGIA, CHOKING, FOREIGN BODY TRAUMA, OROPHARYNGEAL PAIN","Medically Important, "
172955,1/2/2014,,SUSPECT,"CENTRUM SILVER WOMEN'S 50+ (MULTIMINERALS, MULTIVITAMINS) TABLET",54, Vit/Min/Prot/Unconv Diet(Human/Animal),,,,"CHOKING, DYSPHAGIA, FEAR","Medically Important, "
172956,1/2/2014,,SUSPECT,"CENTRUM SILVER MEN'S 50+ (MULTIMINERALS, MULTIVITAMINS) TABLET",54, Vit/Min/Prot/Unconv Diet(Human/Animal),,,,HAEMATOLOGICAL MALIGNANCY,"Medically Important, "
172958,1/2/2014,,SUSPECT,"CENTRUM SILVER WOMEN'S 50+ (MULTIMINERALS, MULTIVITAMINS) TABLET",54, Vit/Min/Prot/Unconv Diet(Human/Animal),71,year(s),,CHOKING,"Medically Important, "
172959,1/2/2014,10/31/2013,SUSPECT,PROTANDIM,54, Vit/Min/Prot/Unconv Diet(Human/Animal),73,year(s),F,"CONSTIPATION, NAUSEA, ABDOMINAL PAIN, ABDOMINAL DISTENSION, FLATULENCE","Hospitalization, "
172960,1/2/2014,,SUSPECT,NUTRILITE GLUCOSAMINE-7,54, Vit/Min/Prot/Unconv Diet(Human/Animal),,,,"INFECTION, DISCOMFORT, ABDOMINAL PAIN UPPER","Hospitalization, "
172961,1/2/2014,11/29/2013,SUSPECT,"ONE A DAY MEN'S HEALTH FORMULA (MULTIVITAMINS, MULTIMINERALS) FILM-COATED TABLET",54, Vit/Min/Prot/Unconv Diet(Human/Animal),45,year(s),M,"DYSPNOEA, CHOKING, FOREIGN BODY TRAUMA","Medically Important, "
172962,1/2/2014,,SUSPECT,NUTRILITE WOMENS PACK BALANCED HEALTH OMEGA-3 SUPPLEMENT,54, Vit/Min/Prot/Unconv Diet(Human/Animal),,,,"HAEMORRHAGE, GENITAL HAEMORRHAGE","Hospitalization, "
172963,1/2/2014,10/31/2013,SUSPECT,"PREVAGEN, 10MG",54, Vit/Min/Prot/Unconv Diet(Human/Animal),85,year(s),F,"COLITIS, DIVERTICULITIS, NAUSEA, VOMITING, FLATULENCE","Hospitalization, "
172964,1/2/2014,10/19/2013,SUSPECT,BOTANIC CHOICE ADVANCED MEMORY COMPLEX,54, Vit/Min/Prot/Unconv Diet(Human/Animal),,,,"DIZZINESS, TREMOR, DEPRESSED MOOD, ANXIETY","Hospitalization, "
172964,1/2/2014,10/19/2013,SUSPECT,BOTANIC CHOICE THYROID COMPLEX CAPSULE,54, Vit/Min/Prot/Unconv Diet(Human/Animal),,,,"DIZZINESS, TREMOR, DEPRESSED MOOD, ANXIETY","Hospitalization, "
172965,1/2/2014,11/22/2013,SUSPECT,"CENTRUM SILVER ADULTS 50+ (MULTIMINERALS, MULTIVITAMINS) TABLET",54, Vit/Min/Prot/Unconv Diet(Human/Animal),66,year(s),F,"HYPERSENSITIVITY, RASH","Medically Important, "
172966,1/2/2014,,SUSPECT,"CENTRUM SILVER WOMENS 50+ (MULTIMINERALS, MULTIVITAMINS) TABLET",54, Vit/Min/Prot/Unconv Diet(Human/Animal),93,year(s),F,"CHOKING, DYSPHAGIA","Medically Important, "
172967,1/3/2014,10/18/2013,SUSPECT,ORGANIC CHOCOLATE SOY MILK,9, Milk/Butter/Dried Milk Prod,4,year(s),,"VOMITING, ABDOMINAL DISCOMFORT","Disability, Patient Visited Healthcare Provider, "
172967,1/3/2014,10/18/2013,SUSPECT,ORGANIC VANILLA SOY MILK,9, Milk/Butter/Dried Milk Prod,4,year(s),,"VOMITING, ABDOMINAL DISCOMFORT","Disability, Patient Visited Healthcare Provider, "
172968,1/3/2014,,SUSPECT,RUSSET POTATO,25, Vegetables/Vegetable Products,,,,"MALAISE, SALMONELLOSIS","Hospitalization, Patient Visited Healthcare Provider, "
172969,1/3/2014,10/18/2013,SUSPECT,NATURE'S PROMISE ORGANIC CHOCOLATE SOY MILK,9, Milk/Butter/Dried Milk Prod,,,,"ABDOMINAL DISCOMFORT, VOMITING","Disability, Patient Visited Healthcare Provider, "
172969,1/3/2014,10/18/2013,SUSPECT,NATURE'S PROMISE ORGANIC VANILLA SOY MILK,9, Milk/Butter/Dried Milk Prod,,,,"ABDOMINAL DISCOMFORT, VOMITING","Disability, Patient Visited Healthcare Provider, "
172970,1/3/2014,,SUSPECT,"CENTRUM SILVER WOMEN'S 50+ (MULTIMINERALS, MULTIVITAMINS) TABLET",54, Vit/Min/Prot/Unconv Diet(Human/Animal),82,year(s),F,"FEAR, BODY HEIGHT DECREASED, CHOKING","Medically Important, "
172971,1/3/2014,12/20/2013,SUSPECT,POPCORN INDIANA DRIZZLE BLACK & WHITE KETTLE CORN,7, Snack Food Item,,,,"TOOTH DISORDER, TOOTH INJURY",Other Outcome
172972,1/3/2014,5/14/2013,SUSPECT,RED DIAMOND SWEET TEA,31, Coffee/Tea,,,,"ABDOMINAL PAIN UPPER, DIARRHOEA, ABDOMINAL PAIN",Other Outcome
172973,1/3/2014,12/20/2013,SUSPECT,REESE GOLDEN SMOKED FILET OF TROUT,16, Fishery/Seafood Prod,,,,"DYSPEPSIA, NAUSEA",Other Outcome
172975,1/4/2014,10/16/2013,SUSPECT,SHRED MATRIX 8 STAGE WEIGHT LOSS SYSTEM,54, Vit/Min/Prot/Unconv Diet(Human/Animal),,,,"HYPERSENSITIVITY, CARDIAC FIBRILLATION, PALPITATIONS, HEART RATE ABNORMAL","Life Threatening, Patient Visited Healthcare Provider, Patient Visited ER, "
172978,1/6/2014,6/26/2013,SUSPECT,SWISS PREMIUM ICED TEA,31, Coffee/Tea,,,,DIARRHOEA,Other Outcome
172979,1/6/2014,12/23/2013,SUSPECT,"ACCERA, INC. AXONA",41, Dietary Conventional Foods/Meal Replacements,78,year(s),F,"BLOOD AMYLASE INCREASED, PANCREATITIS, ABDOMINAL PAIN, VOMITING, LIPASE INCREASED, NAUSEA","Hospitalization, "
172980,1/6/2014,,CONCOMITANT,AMINO ACIDS,54, Vit/Min/Prot/Unconv Diet(Human/Animal),21,year(s),M,"PHARYNGEAL OEDEMA, HYPERSENSITIVITY, DYSPNOEA, RASH, PARAESTHESIA, SWELLING, DIZZINESS, FACE OEDEMA","Medically Important, Patient Visited ER, "
172980,1/6/2014,,CONCOMITANT,FISH OIL,54, Vit/Min/Prot/Unconv Diet(Human/Animal),21,year(s),M,"PHARYNGEAL OEDEMA, HYPERSENSITIVITY, DYSPNOEA, RASH, PARAESTHESIA, SWELLING, DIZZINESS, FACE OEDEMA","Medically Important, Patient Visited ER, "
172980,1/6/2014,,SUSPECT,ASSAULT,54, Vit/Min/Prot/Unconv Diet(Human/Animal),21,year(s),M,"PHARYNGEAL OEDEMA, HYPERSENSITIVITY, DYSPNOEA, RASH, PARAESTHESIA, SWELLING, DIZZINESS, FACE OEDEMA","Medically Important, Patient Visited ER, "
172981,1/6/2014,12/26/2013,SUSPECT,KIRKLAND FAST ACTING LACTASE,54, Vit/Min/Prot/Unconv Diet(Human/Animal),53,year(s),F,"DIARRHOEA, ABDOMINAL PAIN UPPER, VOMITING",Other Outcome
172982,1/6/2014,12/26/2013,SUSPECT,RAW PEPITAS,23, Nuts/Edible Seed,63,year(s),F,"CHILLS, VOMITING, DIZZINESS, HYPERSENSITIVITY, HYPERHIDROSIS","Medically Important, "
172983,1/6/2014,11/17/2013,SUSPECT,TERRY NATURALLY CURAMIN,54, Vit/Min/Prot/Unconv Diet(Human/Animal),70,year(s),F,"MALAISE, BLOOD UREA INCREASED, BLOOD PRESSURE INCREASED, MUSCLE STRAIN, PHARYNGITIS, BLOOD CREATININE INCREASED, HEART RATE INCREASED, PAIN, BLOOD CHLORIDE DECREASED, DIARRHOEA","Medically Important, "
172986,1/6/2014,7/4/2013,SUSPECT,BASA SWAI FISH,16, Fishery/Seafood Prod,,,,"SWELLING, DYSPHAGIA, FOOD POISONING, PRURITUS","Life Threatening, Hospitalization, Patient Visited Healthcare Provider, Patient Visited ER, "
172987,1/6/2014,12/16/2013,SUSPECT,LACTATION VITAMIN BLEND MOTHER'S MILK PLUS,54, Vit/Min/Prot/Unconv Diet(Human/Animal),40,year(s),F,"URTICARIA, HYPERSENSITIVITY",Other Outcome
172988,1/6/2014,1/1/2014,SUSPECT,ALDI OATMEAL,5, Cereal Prep/Breakfast Food,,,,"RASH, PRURITUS GENERALISED, COUGH, BURNING SENSATION, WHEEZING, ANAPHYLACTIC REACTION, SWELLING FACE","Patient Visited ER, "
172989,1/7/2014,9/29/2013,SUSPECT,RESER'S STONEMILL KITCHENS COUNTRY RED POTATO SALAD,39, Prep Salad Prod,2,year(s),,"CONVULSION, NAUSEA, INFECTION, BODY TEMPERATURE INCREASED, ABDOMINAL PAIN UPPER, VOMITING, INFLAMMATION","Patient Visited Healthcare Provider, "
172990,1/7/2014,9/29/2013,SUSPECT,RESER'S STONEMILL KITCHENS COUNTRY RED POTATO SALAD,39, Prep Salad Prod,,,,"ABDOMINAL PAIN UPPER, FATIGUE, NAUSEA",Other Outcome
172991,1/7/2014,9/29/2013,SUSPECT,RESER'S STONEMILL KITCHENS COUNTRY RED POTATO SALAD,39, Prep Salad Prod,,,,"NAUSEA, FATIGUE, ABDOMINAL PAIN UPPER",Other Outcome
172992,1/7/2014,9/29/2013,SUSPECT,RESER'S STONEMILL KITCHENS COUNTRY RED POTATO SALAD,39, Prep Salad Prod,,,,"NAUSEA, ABDOMINAL PAIN UPPER, FATIGUE",Other Outcome
172993,1/7/2014,9/29/2013,SUSPECT,RESER'S STONEMILL KITCHENS COUNTRY RED POTATO SALAD,39, Prep Salad Prod,,,,"FATIGUE, ABDOMINAL PAIN UPPER, NAUSEA",Other Outcome
172994,1/7/2014,9/29/2013,SUSPECT,RESER'S STONEMILL KITCHENS COUNTRY RED POTATO SALAD,39, Prep Salad Prod,,,,"FATIGUE, NAUSEA, ABDOMINAL PAIN UPPER",Other Outcome
172995,1/7/2014,9/29/2013,SUSPECT,RESER'S STONEMILL KITCHENS COUNTRY RED POTATO SALAD,39, Prep Salad Prod,,,,"FATIGUE, NAUSEA, ABDOMINAL PAIN UPPER",Other Outcome
172996,1/7/2014,9/29/2013,SUSPECT,RESER'S STONEMILL KITCHENS COUNTRY RED POTATO SALAD,39, Prep Salad Prod,,,,"FATIGUE, NAUSEA, ABDOMINAL PAIN UPPER",Other Outcome
172998,1/7/2014,,SUSPECT,"CENTRUM SILVER WOMEN'S 50+ (MULTIMINERALS, MULTIVITAMINS) TABLET",54, Vit/Min/Prot/Unconv Diet(Human/Animal),6,Decade(s),F,"FALL, CHOKING","Medically Important, "
172999,1/7/2014,,SUSPECT,"CENTRUM SILVER WOMEN'S 50+ (MULTIMINERALS, MULTIVITAMINS) TABLET",54, Vit/Min/Prot/Unconv Diet(Human/Animal),86,year(s),F,"CHOKING, DYSPHAGIA","Medically Important, "
173000,1/7/2014,,SUSPECT,"ONE A DAY MEN'S HEALTH FORMULA (MULTIVITAMINS, MULTIMINERALS) TABLET",54, Vit/Min/Prot/Unconv Diet(Human/Animal),32,year(s),M,CHOKING,"Medically Important, "
173003,1/7/2014,1/1/2014,SUSPECT,TRADER JOES 4 ALMOND CROISSANTS,3, Bakery Prod/Dough/Mix/Icing,,,,"OESOPHAGEAL INJURY, PHARYNGITIS, THROAT IRRITATION, LACERATION",Other Outcome
173004,1/7/2014,12/17/2013,SUSPECT,BELMONT PEANUTS CHOCO COVERED PEANUT BRITTLE,34, Choc/Cocoa Prod,,,,"SCRATCH, LACERATION","Patient Visited Healthcare Provider, "
173006,1/8/2014,9/29/2013,SUSPECT,RESER'S STONEMILL KITCHENS COUNTRY RED POTATO SALAD,39, Prep Salad Prod,,,,"VOMITING, ABDOMINAL PAIN, MALAISE",Other Outcome
173007,1/8/2014,,SUSPECT,"FLINTSTONE IMMUNITY GUMMIES (MULTIVITAMINS, MINERALS, INOSITOL)",54, Vit/Min/Prot/Unconv Diet(Human/Animal),3,year(s),F,CHOKING,"Medically Important, "
173009,1/8/2014,,SUSPECT,"ONE A DAY WOMEN'S (MULTIVITAMINS, MULTIMINERALS) FILM-COATED TABLET",54, Vit/Min/Prot/Unconv Diet(Human/Animal),74,year(s),F,CHOKING,"Medically Important, "
173011,1/8/2014,11/12/2013,SUSPECT,PROTANDIM US,54, Vit/Min/Prot/Unconv Diet(Human/Animal),42,year(s),F,"PALPITATIONS, ANXIETY, FEELING JITTERY","Medically Important, Patient Visited ER, "
173012,1/8/2014,11/28/2013,SUSPECT,PROTANDIM US,54, Vit/Min/Prot/Unconv Diet(Human/Animal),74,year(s),M,"BLOOD URINE PRESENT, ABDOMINAL PAIN","Hospitalization, "
173014,1/8/2014,,SUSPECT,"CENTRUM ULTRA WOMEN'S (MULTIMINERALS, MULTIVITAMINS) TABLET",54, Vit/Min/Prot/Unconv Diet(Human/Animal),89,year(s),F,"CHOKING, DYSPHAGIA","Medically Important, "
173015,1/8/2014,2/24/2013,CONCOMITANT,ACETYLCHOLINE 850 MG,54, Vit/Min/Prot/Unconv Diet(Human/Animal),79,year(s),M,"HYPERSOMNIA, AMNESIA, HALLUCINATION, CONFUSIONAL STATE, INCONTINENCE, ACTIVITIES OF DAILY LIVING IMPAIRED, CRYING, ABNORMAL BEHAVIOUR, RESTLESSNESS","Disability, Patient Visited Healthcare Provider, "
173015,1/8/2014,2/24/2013,CONCOMITANT,GLYCEROPHOSPHOCHOLINE 600,54, Vit/Min/Prot/Unconv Diet(Human/Animal),79,year(s),M,"HYPERSOMNIA, AMNESIA, HALLUCINATION, CONFUSIONAL STATE, INCONTINENCE, ACTIVITIES OF DAILY LIVING IMPAIRED, CRYING, ABNORMAL BEHAVIOUR, RESTLESSNESS","Disability, Patient Visited Healthcare Provider, "
173015,1/8/2014,2/24/2013,CONCOMITANT,LIQUID B12,54, Vit/Min/Prot/Unconv Diet(Human/Animal),79,year(s),M,"HYPERSOMNIA, AMNESIA, HALLUCINATION, CONFUSIONAL STATE, INCONTINENCE, ACTIVITIES OF DAILY LIVING IMPAIRED, CRYING, ABNORMAL BEHAVIOUR, RESTLESSNESS","Disability, Patient Visited Healthcare Provider, "
173015,1/8/2014,2/24/2013,CONCOMITANT,LIQUID D (UNPSECIFIED),54, Vit/Min/Prot/Unconv Diet(Human/Animal),79,year(s),M,"HYPERSOMNIA, AMNESIA, HALLUCINATION, CONFUSIONAL STATE, INCONTINENCE, ACTIVITIES OF DAILY LIVING IMPAIRED, CRYING, ABNORMAL BEHAVIOUR, RESTLESSNESS","Disability, Patient Visited Healthcare Provider, "
173015,1/8/2014,2/24/2013,CONCOMITANT,PHOSPHATIDYLSERINE 150 MG,54, Vit/Min/Prot/Unconv Diet(Human/Animal),79,year(s),M,"HYPERSOMNIA, AMNESIA, HALLUCINATION, CONFUSIONAL STATE, INCONTINENCE, ACTIVITIES OF DAILY LIVING IMPAIRED, CRYING, ABNORMAL BEHAVIOUR, RESTLESSNESS","Disability, Patient Visited Healthcare Provider, "
173015,1/8/2014,2/24/2013,SUSPECT,BARLEEN'S SALMON OIL,54, Vit/Min/Prot/Unconv Diet(Human/Animal),79,year(s),M,"HYPERSOMNIA, AMNESIA, HALLUCINATION, CONFUSIONAL STATE, INCONTINENCE, ACTIVITIES OF DAILY LIVING IMPAIRED, CRYING, ABNORMAL BEHAVIOUR, RESTLESSNESS","Disability, Patient Visited Healthcare Provider, "
173015,1/8/2014,2/24/2013,SUSPECT,HEART HEALTH OMEGA III FISH OIL,54, Vit/Min/Prot/Unconv Diet(Human/Animal),79,year(s),M,"HYPERSOMNIA, AMNESIA, HALLUCINATION, CONFUSIONAL STATE, INCONTINENCE, ACTIVITIES OF DAILY LIVING IMPAIRED, CRYING, ABNORMAL BEHAVIOUR, RESTLESSNESS","Disability, Patient Visited Healthcare Provider, "
173015,1/8/2014,2/24/2013,SUSPECT,ISOTONIX ACTIVATED B COMPLEX,54, Vit/Min/Prot/Unconv Diet(Human/Animal),79,year(s),M,"HYPERSOMNIA, AMNESIA, HALLUCINATION, CONFUSIONAL STATE, INCONTINENCE, ACTIVITIES OF DAILY LIVING IMPAIRED, CRYING, ABNORMAL BEHAVIOUR, RESTLESSNESS","Disability, Patient Visited Healthcare Provider, "
173015,1/8/2014,2/24/2013,SUSPECT,METAGENICS CERIVA,54, Vit/Min/Prot/Unconv Diet(Human/Animal),79,year(s),M,"HYPERSOMNIA, AMNESIA, HALLUCINATION, CONFUSIONAL STATE, INCONTINENCE, ACTIVITIES OF DAILY LIVING IMPAIRED, CRYING, ABNORMAL BEHAVIOUR, RESTLESSNESS","Disability, Patient Visited Healthcare Provider, "
173015,1/8/2014,2/24/2013,SUSPECT,NUTRIMETRIX ISOTONIX OPC-3,54, Vit/Min/Prot/Unconv Diet(Human/Animal),79,year(s),M,"HYPERSOMNIA, AMNESIA, HALLUCINATION, CONFUSIONAL STATE, INCONTINENCE, ACTIVITIES OF DAILY LIVING IMPAIRED, CRYING, ABNORMAL BEHAVIOUR, RESTLESSNESS","Disability, Patient Visited Healthcare Provider, "
173015,1/8/2014,2/24/2013,SUSPECT,PRIME ASTAXANTHIN,54, Vit/Min/Prot/Unconv Diet(Human/Animal),79,year(s),M,"HYPERSOMNIA, AMNESIA, HALLUCINATION, CONFUSIONAL STATE, INCONTINENCE, ACTIVITIES OF DAILY LIVING IMPAIRED, CRYING, ABNORMAL BEHAVIOUR, RESTLESSNESS","Disability, Patient Visited Healthcare Provider, "
173016,1/8/2014,9/12/2013,SUSPECT,MOVE FREE,54, Vit/Min/Prot/Unconv Diet(Human/Animal),63,year(s),F,"ANOREXIA, LIVER INJURY, DYSPNOEA, CHILLS, NAUSEA","Hospitalization, "
173018,1/8/2014,,SUSPECT,"CALCIUM CARBONATE, CHOLECALCIFEROL (CALCIUM CARBONATE, CHOLECALCIFEROL)",54, Vit/Min/Prot/Unconv Diet(Human/Animal),71,year(s),F,"BONE DISORDER, MUSCLE SPASMS, DRUG INEFFECTIVE, INCORRECT DOSE ADMINISTERED, FOOT DEFORMITY, OVERDOSE, ABASIA","Medically Important, "
173018,1/8/2014,,SUSPECT,"CENTRUM SILVER WOMEN'S 50+ (MULTIMINERALS, MULTIVITAMINS) TABLET",54, Vit/Min/Prot/Unconv Diet(Human/Animal),71,year(s),F,"BONE DISORDER, MUSCLE SPASMS, DRUG INEFFECTIVE, INCORRECT DOSE ADMINISTERED, FOOT DEFORMITY, OVERDOSE, ABASIA","Medically Important, "
173021,1/8/2014,,SUSPECT,SIMILAC ADVANCED PLUS OR COMPLETE NUTRITION POWERED INFANT FORMULA,40, Baby Food Products,16,month(s),F,VOMITING,Other Outcome
173025,1/8/2014,,SUSPECT,BULK PINE NUTS,23, Nuts/Edible Seed,,,,"DYSGEUSIA, DYSGEUSIA, HYPERSENSITIVITY",Other Outcome
173026,1/8/2014,,SUSPECT,WONDERFUL PISTACHIOS ROASTED & SALTED,23, Nuts/Edible Seed,,,,"ABDOMINAL PAIN UPPER, DIARRHOEA",Other Outcome
173027,1/8/2014,11/20/2013,SUSPECT,SKIPPY CREAMY STYLE PEANUT BUTTER,23, Nuts/Edible Seed,,,,"DIARRHOEA, VOMITING",Other Outcome
173028,1/9/2014,,SUSPECT,"CENTRUM SILVER ADULTS 50+ (MULTIMINERALS, MULTIVITAMINS) TABLET",54, Vit/Min/Prot/Unconv Diet(Human/Animal),60,year(s),F,"EYE DISORDER, BURSITIS, UVEITIS, ROTATOR CUFF SYNDROME, EYE INFLAMMATION","Medically Important, "
173029,1/9/2014,,SUSPECT,"CENTRUM SILVER ADULTS 50+ (MULTIMINERALS, MULTIVITAMINS) TABLET",54, Vit/Min/Prot/Unconv Diet(Human/Animal),,,,"THROAT IRRITATION, CHOKING","Medically Important, "
173030,1/9/2014,,SUSPECT,"ONE A DAY WOMEN'S ACTIVE METABOLISM (MULTIVITAMIN, MINERALS, CAFFEINE, CHOLINE) FILM-COATED TABLET",54, Vit/Min/Prot/Unconv Diet(Human/Animal),47,year(s),F,"BLOOD GLUCOSE FLUCTUATION, WRONG TECHNIQUE IN DRUG USAGE PROCESS","Medically Important, "
173030,1/9/2014,,SUSPECT,TRUBIOTICS (BIFIDOBACTERIUM +LACTOBACILLUS) CAPSULE,54, Vit/Min/Prot/Unconv Diet(Human/Animal),47,year(s),F,"BLOOD GLUCOSE FLUCTUATION, WRONG TECHNIQUE IN DRUG USAGE PROCESS","Medically Important, "
173032,1/9/2014,,SUSPECT,"CENTRUM SILVER ADULTS 50+ (MULTIMINERALS, MULTIVITAMINS) TABLET",54, Vit/Min/Prot/Unconv Diet(Human/Animal),,,,CHOKING,"Medically Important, "
173034,1/9/2014,,SUSPECT,"CENTRUM SILVER WOMEN 50+ (MULTIMINERALS, MULTIVITAMINS) TABLET",54, Vit/Min/Prot/Unconv Diet(Human/Animal),,,,"DYSPHAGIA, CHOKING","Medically Important, "
173044,1/9/2014,,SUSPECT,CITRACAL REGULAR (CHOLECALCIFEROL + CALCIUM CALTRATE) FILM-COATED TABLET,54, Vit/Min/Prot/Unconv Diet(Human/Animal),,,,COELIAC DISEASE,"Medically Important, "
173046,1/9/2014,12/2/2013,SUSPECT,CITRACAL PETITES (CHOLECALCIFEROL + CALCIUM CITRATE) FILM-COATED TABELT,54, Vit/Min/Prot/Unconv Diet(Human/Animal),79,year(s),F,CHOKING,"Medically Important, "
173047,1/9/2014,,SUSPECT,CITRACAL MAXIMUM (CHOLECALCIFEROL + CALCIUM CITRATE) FILM-COATED TABLET,54, Vit/Min/Prot/Unconv Diet(Human/Animal),83,year(s),F,CHOKING,"Medically Important, "
173048,1/9/2014,5/21/2013,SUSPECT,OXYELITE PRO SUPER THERMO DIETARY SUPPLEMENT,54, Vit/Min/Prot/Unconv Diet(Human/Animal),,,,"CHOLECYSTITIS INFECTIVE, GALLBLADDER OPERATION, LIVER INJURY, GALLBLADDER ENLARGEMENT, CHOLELITHIASIS, ABDOMINAL PAIN UPPER","Life Threatening, Hospitalization, Disability, Medically Important, "
173049,1/9/2014,,SUSPECT,USP LABS OXYELITE PRO,54, Vit/Min/Prot/Unconv Diet(Human/Animal),32,year(s),F,"WHITE BLOOD CELL COUNT DECREASED, ARTHRALGIA, FATIGUE, MALAISE, RED BLOOD CELL COUNT DECREASED","Patient Visited Healthcare Provider, Medically Important, "
173061,1/9/2014,7/1/2013,SUSPECT,EXEMPTION 4,54, Vit/Min/Prot/Unconv Diet(Human/Animal),21,year(s),M,"HALLUCINATION, DECREASED APPETITE, CARDIAC DISORDER, PARANOIA, IRRITABILITY","Disability, "
173062,1/9/2014,11/30/2013,CONCOMITANT,MULTIVITAMIN,54, Vit/Min/Prot/Unconv Diet(Human/Animal),50,year(s),F,"DIZZINESS, DIARRHOEA, HEART RATE INCREASED, TREMOR, NAUSEA, HYPERSENSITIVITY","Medically Important, Patient Visited ER, "
173062,1/9/2014,11/30/2013,SUSPECT,GNC HERBAL PLUS STANDARDIZED YOHIMBE,54, Vit/Min/Prot/Unconv Diet(Human/Animal),50,year(s),F,"DIZZINESS, DIARRHOEA, HEART RATE INCREASED, TREMOR, NAUSEA, HYPERSENSITIVITY","Medically Important, Patient Visited ER, "
173063,1/9/2014,12/18/2013,SUSPECT,ORGANIC GRAVESTEIN APPLE JUICE,20, Fruit/Fruit Prod,11,year(s),M,"MALAISE, VOMITING, DIARRHOEA","Medically Important, "
173064,1/9/2014,12/18/2013,SUSPECT,ORGANIC INFANT PUREE POUCH,22, Fruit/Fruit Prod,14,month(s),F,VOMITING,"Medically Important, "
173066,1/9/2014,,CONCOMITANT,EXEMPTION 4,54, Vit/Min/Prot/Unconv Diet(Human/Animal),94,year(s),F,"CONFUSIONAL STATE, COMPULSIONS, BLOOD GLUCOSE INCREASED, AGITATION, NIGHTMARE, HEADACHE, INCREASED APPETITE","Medically Important, "
173066,1/9/2014,,SUSPECT,EXEMPTION 4,41, Dietary Conventional Foods/Meal Replacements,94,year(s),F,"CONFUSIONAL STATE, COMPULSIONS, BLOOD GLUCOSE INCREASED, AGITATION, NIGHTMARE, HEADACHE, INCREASED APPETITE","Medically Important, "
173067,1/9/2014,,CONCOMITANT,ONE-A-DAY ESSENTIAL (MULTIVITAMINS) TABLET,54, Vit/Min/Prot/Unconv Diet(Human/Animal),71,year(s),F,CHOKING,Other Outcome
173067,1/9/2014,,SUSPECT,CITRACAL PETITES (CHOLECALCIFEROL + CALCIUM CITRATE) FILM-COATED TABLET,54, Vit/Min/Prot/Unconv Diet(Human/Animal),71,year(s),F,CHOKING,Other Outcome
173068,1/9/2014,12/1/2013,SUSPECT,NUTRASEA DHA 500 1000 ASCENTA HEALTH LTD.,54, Vit/Min/Prot/Unconv Diet(Human/Animal),87,year(s),F,"SWOLLEN TONGUE, HYPERSENSITIVITY, HEADACHE, PRURITUS, GENERALISED ERYTHEMA, DYSPNOEA","Medically Important, "
173069,1/9/2014,,CONCOMITANT,FISH OIL,54, Vit/Min/Prot/Unconv Diet(Human/Animal),55,year(s),F,"PALPITATIONS, DYSPNOEA, INSOMNIA, CHEST DISCOMFORT","Patient Visited Healthcare Provider, Medically Important, "
173069,1/9/2014,,CONCOMITANT,MULTIVITAMIN,54, Vit/Min/Prot/Unconv Diet(Human/Animal),55,year(s),F,"PALPITATIONS, DYSPNOEA, INSOMNIA, CHEST DISCOMFORT","Patient Visited Healthcare Provider, Medically Important, "
173069,1/9/2014,,SUSPECT,NATUREMADE CALCIUM 600 MG WITH VITAMIN D LIQUID SOFTGEL,54, Vit/Min/Prot/Unconv Diet(Human/Animal),55,year(s),F,"PALPITATIONS, DYSPNOEA, INSOMNIA, CHEST DISCOMFORT","Patient Visited Healthcare Provider, Medically Important, "
173070,1/9/2014,,SUSPECT,NATUREMADE L-LYSINE 1000 MG,54, Vit/Min/Prot/Unconv Diet(Human/Animal),,,,FOREIGN BODY TRAUMA,"Medically Important, "
173071,1/9/2014,11/10/2013,SUSPECT,PYCNOGENOL SUPER FORMULA,54, Vit/Min/Prot/Unconv Diet(Human/Animal),52,year(s),M,VISUAL IMPAIRMENT,"Disability, Medically Important, Patient Visited ER, "
173072,1/9/2014,11/26/2013,CONCOMITANT,HERBALIFE FORMULA 1,41, Dietary Conventional Foods/Meal Replacements,26,year(s),M,"LOSS OF CONSCIOUSNESS, THROAT TIGHTNESS, PRURITUS, RASH GENERALISED, DYSPNOEA","Life Threatening, Patient Visited ER, "