﻿DATE_FDA_FIRST_RECEIVED_REPORT,REPORT_ID,DATE_EVENT,PRODUCT_TYPE,PRODUCT,PRODUCT_CODE,DESCRIPTION,PATIENT_AGE,AGE_UNITS,SEX,CASE_MEDDRA_PREFERRED_TERMS,CASE_OUTCOME
3/31/2023,2023-CFS-003497,,SUSPECT,NUTRAFOL HAIR SERUM WOMEN,53,Cosmetics,72,year(s),Female,"Alopecia, Myocardial infarction, Nausea, Vomiting","Hospitalization, Visited Emergency Room, Other Serious Outcome"
3/31/2023,2023-CFS-003497,,SUSPECT,NUTRAFOL ROOT PURIFIER SCALP MICROBIOME SHAMPOO,53,Cosmetics,72,year(s),Female,"Alopecia, Myocardial infarction, Nausea, Vomiting","Hospitalization, Visited Emergency Room, Other Serious Outcome"
3/31/2023,2023-CFS-003497,,SUSPECT,NUTRAFOL STRAND DEFENDER LIGHTWEIGHT PROTECTIVE CONDITIONER,53,Cosmetics,72,year(s),Female,"Alopecia, Myocardial infarction, Nausea, Vomiting","Hospitalization, Visited Emergency Room, Other Serious Outcome"
3/31/2023,2023-CFS-003497,,SUSPECT,NUTRAFOL WOMEN,54,Vit/Min/Prot/Unconv Diet(Human/Animal),72,year(s),Female,"Alopecia, Myocardial infarction, Nausea, Vomiting","Hospitalization, Visited Emergency Room, Other Serious Outcome"
3/31/2023,2023-CFS-003496,3/12/2023,SUSPECT,ISAGENIX IONIX SUPREME POWDER CANISTER,54,Vit/Min/Prot/Unconv Diet(Human/Animal),41,year(s),Female,"Dyspnoea, Pruritus, Swelling face, Swollen tongue, Urticaria, Wheezing","Visited Emergency Room, Other Serious Outcome"
3/31/2023,2023-CFS-003496,3/12/2023,SUSPECT,ISAGENIX XM PLUS,54,Vit/Min/Prot/Unconv Diet(Human/Animal),41,year(s),Female,"Dyspnoea, Pruritus, Swelling face, Swollen tongue, Urticaria, Wheezing","Visited Emergency Room, Other Serious Outcome"
3/31/2023,2023-CFS-003495,,SUSPECT,WOMEN'S BALANCE,54,Vit/Min/Prot/Unconv Diet(Human/Animal),65,year(s),Female,"Blood pressure increased, Cerebrovascular accident, Lacrimation increased, Malaise, Mental impairment, Paralysis, Thermal burns of eye","Hospitalization, Other Serious Outcome"
3/31/2023,2023-CFS-003494,,SUSPECT,WOMEN'S BALANCE,54,Vit/Min/Prot/Unconv Diet(Human/Animal),53,year(s),Female,"Diarrhoea, Headache, Nausea, Vomiting, Weight decreased","Visited Emergency Room, Other Serious Outcome"
3/31/2023,2023-CFS-003493,,SUSPECT,NOW® PRENATAL GELS WITH DHA – 90 SOFTGELS,54,Vit/Min/Prot/Unconv Diet(Human/Animal),33,year(s),Female,Abortion spontaneous,Other Serious Outcome
3/31/2023,2023-CFS-003477,3/23/2023,SUSPECT,ONIONS,24,Vegetables/Vegetable Products,33,year(s),Female,Malaise,Other Serious Outcome
3/31/2023,2023-CFS-003472,3/7/2023,SUSPECT,AG1 WHOLE FOOD DIETARY SUPPLEMENT - 360G (12.7),54,Vit/Min/Prot/Unconv Diet(Human/Animal),79,year(s),Female,"Asthenia, Blood potassium decreased, Dehydration, Vomiting","Visited Emergency Room, Other Serious Outcome"
3/31/2023,2023-CFS-003468,,SUSPECT,ONE-A-DAY PROACTIVE 65+,54,Vit/Min/Prot/Unconv Diet(Human/Animal),75,year(s),Female,Foreign body in throat,Other Serious Outcome
3/31/2023,2023-CFS-003468,,CONCOMITANT,Other Therapeutic Products,54,Vit/Min/Prot/Unconv Diet(Human/Animal),75,year(s),Female,Foreign body in throat,Other Serious Outcome
3/31/2023,2023-CFS-003466,3/30/2023,SUSPECT,ABBOTT SIMILAC ADVANCE,40P,Powder Formula,1,year(s),Male,Blood lead increased,Other Serious or Important Medical Event
3/31/2023,2023-CFS-003465,3/30/2023,SUSPECT,KRATOM,54,Vit/Min/Prot/Unconv Diet(Human/Animal),34,year(s),Male,"Feeling drunk, Headache, Nausea, Paraesthesia, Vomiting",Other Outcome
3/31/2023,2023-CFS-003457,2/28/2023,SUSPECT,TEMPORARY TATTOO,53,Cosmetics,24,year(s),Female,"Chemical burn, Pain, Pruritus, Scar",Other Serious Outcome
3/31/2023,2023-CFS-003457,2/28/2023,CONCOMITANT,Probiotic,54,Vit/Min/Prot/Unconv Diet(Human/Animal),24,year(s),Female,"Chemical burn, Pain, Pruritus, Scar",Other Serious Outcome
3/31/2023,2023-CFS-003451,11/11/2022,SUSPECT,NAIR BODY CREAM SOFTENING BABY OIL TOTTLE,53,Cosmetics,32,year(s),Female,"Application site exfoliation, Application site pain, Application site scar, Burns second degree, Emotional distress, Impaired quality of life, Skin irritation","Disability, Other Serious Outcome"
3/30/2023,2023-CFS-003433,2/1/2023,SUSPECT,OLAPLEX NO. 4 BOND MAINTENANCE SHAMPOO,53,Cosmetics,43,year(s),Female,Alopecia,Other Serious or Important Medical Event
3/30/2023,2023-CFS-003433,2/1/2023,SUSPECT,OLAPLEX NO. 5 BOND MAINTENANCE CONDITIONER,53,Cosmetics,43,year(s),Female,Alopecia,Other Serious or Important Medical Event
3/30/2023,2023-CFS-003424,1/25/2023,SUSPECT,OLAPLEX,53,Cosmetics,73,year(s),Female,"Alopecia, Pruritus",Other Serious Outcome
3/30/2023,2023-CFS-003421,3/13/2023,SUSPECT,"DOUGLAS LABORATORIES METHYL FOLATE 1,000 MCG METAFOLIN TABLETS",54,Vit/Min/Prot/Unconv Diet(Human/Animal),32,year(s),,"Anaphylactic reaction, Burning sensation, Dyspnoea, Pharyngeal swelling, Swelling face, Urticaria","Life Threatening, Hospitalization, Visited Emergency Room, Allergic Reaction, Other Serious Outcome"
3/30/2023,2023-CFS-003421,3/13/2023,SUSPECT,SEEKING HEALTH B-MINUS B12 AND FOLATE FREE VEGETARIAN CAPSULES,54,Vit/Min/Prot/Unconv Diet(Human/Animal),32,year(s),,"Anaphylactic reaction, Burning sensation, Dyspnoea, Pharyngeal swelling, Swelling face, Urticaria","Life Threatening, Hospitalization, Visited Emergency Room, Allergic Reaction, Other Serious Outcome"
3/30/2023,2023-CFS-003421,3/13/2023,SUSPECT,VITAL NUTRIENTS IRON PLUS C 20MG/200MG VEGETARIAN CAPSULES,54,Vit/Min/Prot/Unconv Diet(Human/Animal),32,year(s),,"Anaphylactic reaction, Burning sensation, Dyspnoea, Pharyngeal swelling, Swelling face, Urticaria","Life Threatening, Hospitalization, Visited Emergency Room, Allergic Reaction, Other Serious Outcome"
3/30/2023,2023-CFS-003421,3/13/2023,CONCOMITANT,melatonin,54,Vit/Min/Prot/Unconv Diet(Human/Animal),32,year(s),,"Anaphylactic reaction, Burning sensation, Dyspnoea, Pharyngeal swelling, Swelling face, Urticaria","Life Threatening, Hospitalization, Visited Emergency Room, Allergic Reaction, Other Serious Outcome"
3/30/2023,2023-CFS-003421,3/13/2023,CONCOMITANT,orthobiotic (presumed to be Ortho Biotic),54,Vit/Min/Prot/Unconv Diet(Human/Animal),32,year(s),,"Anaphylactic reaction, Burning sensation, Dyspnoea, Pharyngeal swelling, Swelling face, Urticaria","Life Threatening, Hospitalization, Visited Emergency Room, Allergic Reaction, Other Serious Outcome"
3/30/2023,2023-CFS-003421,3/13/2023,CONCOMITANT,vitamin D,54,Vit/Min/Prot/Unconv Diet(Human/Animal),32,year(s),,"Anaphylactic reaction, Burning sensation, Dyspnoea, Pharyngeal swelling, Swelling face, Urticaria","Life Threatening, Hospitalization, Visited Emergency Room, Allergic Reaction, Other Serious Outcome"
3/30/2023,2023-CFS-003420,3/7/2023,SUSPECT,"  PALEO PROTEIN, VANILLA BEAN",54,Vit/Min/Prot/Unconv Diet(Human/Animal),,,Female,"Hypersensitivity, Lip swelling, Nasal oedema, Pharyngeal swelling",Other Serious Outcome
3/30/2023,2023-CFS-003419,3/28/2023,SUSPECT,DELTA-8,54,Vit/Min/Prot/Unconv Diet(Human/Animal),24,year(s),Male,"Anxiety, Panic attack",Other Serious Outcome
3/30/2023,2023-CFS-003419,3/28/2023,SUSPECT,HEMPLUCID CBD 40 MG SHOT,54,Vit/Min/Prot/Unconv Diet(Human/Animal),24,year(s),Male,"Anxiety, Panic attack",Other Serious Outcome
3/30/2023,2023-CFS-003419,3/28/2023,CONCOMITANT,CBD SHOT,54,Vit/Min/Prot/Unconv Diet(Human/Animal),24,year(s),Male,"Anxiety, Panic attack",Other Serious Outcome
3/30/2023,2023-CFS-003416,,SUSPECT, ONE A DAY WOMENS VITACRAVES GUMMIES,54,Vit/Min/Prot/Unconv Diet(Human/Animal),,,,Loss of consciousness,Other Serious Outcome
3/30/2023,2023-CFS-003406,3/29/2023,SUSPECT,EOS LIP BALM,53,Cosmetics,38.6,year(s),Female,"Lip swelling, Oral discomfort, Pruritus",Other Outcome
3/29/2023,2023-CFS-003442,,SUSPECT,CENTO BRAND LUPINE IN GLASS JAR,24,Vegetables/Vegetable Products,,,,Hypersensitivity,Allergic Reaction
3/29/2023,2023-CFS-003414,3/26/2023,SUSPECT, WEESPROUT GLASS BABY FOOD STORAGE JARS - 8 SET | 8 OUNCE BABY FOOD JAR,37,Mult Food Dinner/Grav/Sauce/Special,11,month(s),Male,Exposure to lead,Life Threatening
3/29/2023,2023-CFS-003413,1/1/2016,SUSPECT,AUSSIE HEAT TREATMENTS 3 MINUTE MIRACLE,53,Cosmetics,17,year(s),Male,"Asthma, Hypersensitivity, Peripheral paralysis",Other Outcome
3/29/2023,2023-CFS-003412,,SUSPECT,LACTOBACILLUS VISBIOME,54,Vit/Min/Prot/Unconv Diet(Human/Animal),36,year(s),Male,"Depression, Fatigue, Inflammation, Pain",Other Serious or Important Medical Event
3/29/2023,2023-CFS-003405,3/29/2023,SUSPECT,ARTRI AJO KING,54,Vit/Min/Prot/Unconv Diet(Human/Animal),62,year(s),Male,"Arrhythmia, Hypotension","Hospitalization, Other Serious or Important Medical Event"
3/29/2023,2023-CFS-003398,1/21/2023,SUSPECT,BATTER THAN GOOD BAKING CO BAGELS,3,Bakery Prod/Dough/Mix/Icing,9,year(s),Male,"Gluten sensitivity, Malaise",Other Serious or Important Medical Event
3/29/2023,2023-CFS-003398,1/21/2023,SUSPECT,BATTER THAN GOOD BAKING CO BREAD,3,Bakery Prod/Dough/Mix/Icing,9,year(s),Male,"Gluten sensitivity, Malaise",Other Serious or Important Medical Event
3/29/2023,2023-CFS-003398,1/21/2023,SUSPECT,BATTER THAN GOOD BAKING CO BROWNIES,3,Bakery Prod/Dough/Mix/Icing,9,year(s),Male,"Gluten sensitivity, Malaise",Other Serious or Important Medical Event
3/29/2023,2023-CFS-003398,1/21/2023,SUSPECT,BATTER THAN GOOD BAKING CO CROISSANTS,3,Bakery Prod/Dough/Mix/Icing,9,year(s),Male,"Gluten sensitivity, Malaise",Other Serious or Important Medical Event
3/29/2023,2023-CFS-003398,1/21/2023,CONCOMITANT,Probiotics,54,Vit/Min/Prot/Unconv Diet(Human/Animal),9,year(s),Male,"Gluten sensitivity, Malaise",Other Serious or Important Medical Event
3/29/2023,2023-CFS-003393,3/9/2023,SUSPECT,PERSONA  DAILY PROBIOTIC PROPRIETARY ACIDOPHILUS BLEND 3 BILLION CFU GELATIN CAPSULES,54,Vit/Min/Prot/Unconv Diet(Human/Animal),42,year(s),Female,"Dyspnoea, Lip swelling, Swollen tongue",Other Serious Outcome
3/29/2023,2023-CFS-003393,3/9/2023,SUSPECT,PERSONA BOSWELLIA VEGETABLE CAPSULES,54,Vit/Min/Prot/Unconv Diet(Human/Animal),42,year(s),Female,"Dyspnoea, Lip swelling, Swollen tongue",Other Serious Outcome
3/29/2023,2023-CFS-003393,3/9/2023,SUSPECT,PERSONA CBD HEMP EXTRACT GELATIN CAPSULES,54,Vit/Min/Prot/Unconv Diet(Human/Animal),42,year(s),Female,"Dyspnoea, Lip swelling, Swollen tongue",Other Serious Outcome
3/29/2023,2023-CFS-003393,3/9/2023,SUSPECT,PERSONA CORDYCEPS (PAECILOMYCES HEPIALS) (MYCELIUM) 750 MG GELATIN CAPSULES,54,Vit/Min/Prot/Unconv Diet(Human/Animal),42,year(s),Female,"Dyspnoea, Lip swelling, Swollen tongue",Other Serious Outcome
3/29/2023,2023-CFS-003393,3/9/2023,SUSPECT,PERSONA FOUNDATIONAL MULTIVITAMIN VEGAN CAPSULES,54,Vit/Min/Prot/Unconv Diet(Human/Animal),42,year(s),Female,"Dyspnoea, Lip swelling, Swollen tongue",Other Serious Outcome
3/29/2023,2023-CFS-003393,3/9/2023,SUSPECT,PERSONA HERBAL REST VEGETARIAN CAPSULES,54,Vit/Min/Prot/Unconv Diet(Human/Animal),42,year(s),Female,"Dyspnoea, Lip swelling, Swollen tongue",Other Serious Outcome
3/29/2023,2023-CFS-003393,3/9/2023,SUSPECT,PERSONA IRON WITH VITAMIN C VEGETARIAN CAPSULES,54,Vit/Min/Prot/Unconv Diet(Human/Animal),42,year(s),Female,"Dyspnoea, Lip swelling, Swollen tongue",Other Serious Outcome
3/29/2023,2023-CFS-003393,3/9/2023,SUSPECT,PERSONA TURMERIC GELATIN CAPSULES,54,Vit/Min/Prot/Unconv Diet(Human/Animal),42,year(s),Female,"Dyspnoea, Lip swelling, Swollen tongue",Other Serious Outcome
3/29/2023,2023-CFS-003393,3/9/2023,SUSPECT,PERSONA VITAMIN D 1000 IU (AS D3 CHOLECALCIFEROL 25MCG) GELATIN CAPSULES,54,Vit/Min/Prot/Unconv Diet(Human/Animal),42,year(s),Female,"Dyspnoea, Lip swelling, Swollen tongue",Other Serious Outcome
3/29/2023,2023-CFS-003392,3/28/2023,SUSPECT,AUSSIE KIDS MOIST CONDITIONER REVITALISANT,53,Cosmetics,3,year(s),Female,"Erythema, Feeling hot, Urticaria",Other Outcome
3/29/2023,2023-CFS-003391,3/28/2023,SUSPECT, NATURAL DELIGHTS WHOLE FRESH MEDJOOL DATES,21,Fruit/Fruit Prod,31,year(s),Female,Nausea,Other Outcome
3/29/2023,2023-CFS-003389,3/11/2023,SUSPECT,ANCIENT NUTRIENTS VITAMIN D,54,Vit/Min/Prot/Unconv Diet(Human/Animal),67,year(s),,"Arthralgia, Feeling abnormal, Fine motor skill dysfunction, Hallucination, Muscle discomfort",Hospitalization
3/29/2023,2023-CFS-003382,3/28/2023,SUSPECT,COOKIES CON AMORE HANDMADE ITALIAN COOKIES SPRING ASSORTMENT,3,Bakery Prod/Dough/Mix/Icing,27.4,year(s),Female,Anaphylactic reaction,"Life Threatening, Hospitalization, Other Serious or Important Medical Event, Allergic Reaction"
3/29/2023,2023-CFS-003381,3/27/2023,SUSPECT,LILU FARMS DELTA 8 50MG GUMMY,33,Candy W/O Choc/Special/Chew Gum,32,year(s),Female,Derealisation,"Other Serious or Important Medical Event, Visited a Health Care Provider"
3/28/2023,2023-CFS-003380,3/27/2023,SUSPECT,FLOW ALKALINE SPRING WATER,41,Dietary Conventional Foods/Meal Replacements,46,year(s),Female,"Abdominal discomfort, Abdominal pain upper, Vomiting",Other Serious or Important Medical Event
3/28/2023,2023-CFS-003378,,SUSPECT,3 IN 1 ANTIOXIDANT EYE CREAM,53,Cosmetics,,,Female,"Burning sensation, Contusion, Rash, Skin irritation",Other Outcome
3/28/2023,2023-CFS-003378,,SUSPECT,BODY BUTTER,53,Cosmetics,,,Female,"Burning sensation, Contusion, Rash, Skin irritation",Other Outcome
3/28/2023,2023-CFS-003378,,SUSPECT,DRAGON'S BLOOD MOISTURIZER,53,Cosmetics,,,Female,"Burning sensation, Contusion, Rash, Skin irritation",Other Outcome
3/28/2023,2023-CFS-003377,12/11/2021,SUSPECT,OLAPLEX,53,Cosmetics,58,year(s),Female,"Alopecia, Trichorrhexis",Other Outcome
3/28/2023,2023-CFS-003376,3/27/2023,SUSPECT,FLORASTOR KIDS,54,Vit/Min/Prot/Unconv Diet(Human/Animal),18,month(s),Male,"Eye swelling, Urticaria",Other Serious or Important Medical Event
3/28/2023,2023-CFS-003374,3/21/2023,SUSPECT,ARTHRIKING,54,Vit/Min/Prot/Unconv Diet(Human/Animal),39,year(s),Male,"Clostridium difficile infection, Cushingoid, Skin striae",Hospitalization
3/28/2023,2023-CFS-003365,,SUSPECT,QUAKER OATS LIFE CEREAL,5,Cereal Prep/Breakfast Food,,,,Nausea,Other Serious or Important Medical Event
3/28/2023,2023-CFS-003348,,SUSPECT,ISAGENIX ISAGENESIS,54,Vit/Min/Prot/Unconv Diet(Human/Animal),77,year(s),Male,"Asthenia, Chest pain, Hypertension, Malaise","Hospitalization, Visited Emergency Room"
3/28/2023,2023-CFS-003347,3/23/2023,SUSPECT,MODERE ACTIVATE 3CT,54,Vit/Min/Prot/Unconv Diet(Human/Animal),44,year(s),Female,"Abdominal pain upper, Dehydration, Diarrhoea, Nausea, Retching, Skin discolouration, Vomiting","Other Serious or Important Medical Event, Visited Emergency Room, Other Serious Outcome"
3/28/2023,2023-CFS-003347,3/23/2023,SUSPECT,MODERE BURN ,54,Vit/Min/Prot/Unconv Diet(Human/Animal),44,year(s),Female,"Abdominal pain upper, Dehydration, Diarrhoea, Nausea, Retching, Skin discolouration, Vomiting","Other Serious or Important Medical Event, Visited Emergency Room, Other Serious Outcome"
3/28/2023,2023-CFS-003347,3/23/2023,CONCOMITANT,Aloe Vera,54,Vit/Min/Prot/Unconv Diet(Human/Animal),44,year(s),Female,"Abdominal pain upper, Dehydration, Diarrhoea, Nausea, Retching, Skin discolouration, Vomiting","Other Serious or Important Medical Event, Visited Emergency Room, Other Serious Outcome"
3/28/2023,2023-CFS-003347,3/23/2023,CONCOMITANT,Axis Optipack 30ct,54,Vit/Min/Prot/Unconv Diet(Human/Animal),44,year(s),Female,"Abdominal pain upper, Dehydration, Diarrhoea, Nausea, Retching, Skin discolouration, Vomiting","Other Serious or Important Medical Event, Visited Emergency Room, Other Serious Outcome"
3/28/2023,2023-CFS-003347,3/23/2023,CONCOMITANT,Fiber,54,Vit/Min/Prot/Unconv Diet(Human/Animal),44,year(s),Female,"Abdominal pain upper, Dehydration, Diarrhoea, Nausea, Retching, Skin discolouration, Vomiting","Other Serious or Important Medical Event, Visited Emergency Room, Other Serious Outcome"
3/28/2023,2023-CFS-003347,3/23/2023,CONCOMITANT,Liquid BioCell Immune 450ml,54,Vit/Min/Prot/Unconv Diet(Human/Animal),44,year(s),Female,"Abdominal pain upper, Dehydration, Diarrhoea, Nausea, Retching, Skin discolouration, Vomiting","Other Serious or Important Medical Event, Visited Emergency Room, Other Serious Outcome"
3/28/2023,2023-CFS-003347,3/23/2023,CONCOMITANT,Trim (non-specific),54,Vit/Min/Prot/Unconv Diet(Human/Animal),44,year(s),Female,"Abdominal pain upper, Dehydration, Diarrhoea, Nausea, Retching, Skin discolouration, Vomiting","Other Serious or Important Medical Event, Visited Emergency Room, Other Serious Outcome"
3/28/2023,2023-CFS-003343,3/25/2023,SUSPECT,WET N WILD MEGALINER LIQUID EYELINER,53,Cosmetics,42,year(s),Female,"Eye pruritus, Hypersensitivity, Ocular hyperaemia, Periorbital swelling",Other Outcome
3/28/2023,2023-CFS-003339,,SUSPECT,CITRACAL PETITES,54,Vit/Min/Prot/Unconv Diet(Human/Animal),,,Male,"Choking, Pharyngeal injury","Life Threatening, Other Serious Outcome"
3/28/2023,2023-CFS-003335,3/26/2023,SUSPECT,HAW PIECE,33,Candy W/O Choc/Special/Chew Gum,2,year(s),Female,Diarrhoea,Other Serious or Important Medical Event
3/28/2023,2023-CFS-003333,11/16/2022,SUSPECT,JERGENS ULTRA HEALING,53,Cosmetics,10,year(s),Male,"Hypersensitivity, Rash",Other Outcome
3/28/2023,2023-CFS-003332,3/25/2023,SUSPECT,KING ARTHUR BREAD FLOUR BLUE BAG,3,Bakery Prod/Dough/Mix/Icing,75,year(s),Female,"Abdominal pain upper, Anaphylactic reaction, Oedema, Skin burning sensation","Other Serious or Important Medical Event, Allergic Reaction"
3/28/2023,2023-CFS-003332,3/25/2023,CONCOMITANT,B-12 tab,54,Vit/Min/Prot/Unconv Diet(Human/Animal),75,year(s),Female,"Abdominal pain upper, Anaphylactic reaction, Oedema, Skin burning sensation","Other Serious or Important Medical Event, Allergic Reaction"
3/28/2023,2023-CFS-003332,3/25/2023,CONCOMITANT,D3,54,Vit/Min/Prot/Unconv Diet(Human/Animal),75,year(s),Female,"Abdominal pain upper, Anaphylactic reaction, Oedema, Skin burning sensation","Other Serious or Important Medical Event, Allergic Reaction"
3/28/2023,2023-CFS-003332,3/25/2023,CONCOMITANT,K2,54,Vit/Min/Prot/Unconv Diet(Human/Animal),75,year(s),Female,"Abdominal pain upper, Anaphylactic reaction, Oedema, Skin burning sensation","Other Serious or Important Medical Event, Allergic Reaction"
3/28/2023,2023-CFS-003332,3/25/2023,CONCOMITANT,b2,54,Vit/Min/Prot/Unconv Diet(Human/Animal),75,year(s),Female,"Abdominal pain upper, Anaphylactic reaction, Oedema, Skin burning sensation","Other Serious or Important Medical Event, Allergic Reaction"
3/28/2023,2023-CFS-003332,3/25/2023,CONCOMITANT,fish oil,54,Vit/Min/Prot/Unconv Diet(Human/Animal),75,year(s),Female,"Abdominal pain upper, Anaphylactic reaction, Oedema, Skin burning sensation","Other Serious or Important Medical Event, Allergic Reaction"
3/28/2023,2023-CFS-003332,3/25/2023,CONCOMITANT,ginkgo biloba,54,Vit/Min/Prot/Unconv Diet(Human/Animal),75,year(s),Female,"Abdominal pain upper, Anaphylactic reaction, Oedema, Skin burning sensation","Other Serious or Important Medical Event, Allergic Reaction"
3/28/2023,2023-CFS-003332,3/25/2023,CONCOMITANT,multi vitamin,54,Vit/Min/Prot/Unconv Diet(Human/Animal),75,year(s),Female,"Abdominal pain upper, Anaphylactic reaction, Oedema, Skin burning sensation","Other Serious or Important Medical Event, Allergic Reaction"
3/28/2023,2023-CFS-003332,3/25/2023,CONCOMITANT,red wine extract,54,Vit/Min/Prot/Unconv Diet(Human/Animal),75,year(s),Female,"Abdominal pain upper, Anaphylactic reaction, Oedema, Skin burning sensation","Other Serious or Important Medical Event, Allergic Reaction"
3/28/2023,2023-CFS-003330,3/28/2023,SUSPECT,BEECH-NUT NATURALS,40,Baby Food Products,7,month(s),Male,Fungal infection,Other Outcome
3/28/2023,2023-CFS-003330,3/28/2023,CONCOMITANT,Enfamil multivitamin drops growth&immuine health,54,Vit/Min/Prot/Unconv Diet(Human/Animal),7,month(s),Male,Fungal infection,Other Outcome
3/28/2023,2023-CFS-003328,3/27/2023,SUSPECT,EXEMPTION 4,29,Soft Drink/Water,,,Female,Psychosexual disorder,Life Threatening
3/28/2023,2023-CFS-003321,3/20/2023,SUSPECT,L'OREAL PARIS EXCELLENCE CREME HAIR COLOR EXTRA LIGHT NATURAL BLONDE,53,Cosmetics,33,year(s),Female,Alopecia,Other Outcome
3/28/2023,2023-CFS-003321,3/20/2023,SUSPECT,LOREAL PARIS BLONDE DYE,53,Cosmetics,33,year(s),Female,Alopecia,Other Outcome
3/27/2023,2023-CFS-003418,2/21/2023,SUSPECT,ORTIGA MAS AJO REY EXTRA FORTE,54,Vit/Min/Prot/Unconv Diet(Human/Animal),47,year(s),Male,Thrombosis,"Hospitalization, Disability, Other Serious or Important Medical Event"
3/27/2023,2023-CFS-003338,3/15/2023,SUSPECT,THE ORIGINAL GRAPE NUTS,5,Cereal Prep/Breakfast Food,,,Male,"Abdominal discomfort, Abdominal distension, Eructation, Flatulence",Other Serious Outcome
3/27/2023,2023-CFS-003326,3/23/2023,SUSPECT,TRADER JOE'S ORGANICS BABY LETTUCE MIX,39,Prep Salad Prod,65,year(s),Male,Diarrhoea,Other Serious or Important Medical Event
3/27/2023,2023-CFS-003325,3/9/2023,SUSPECT,KEYSTONE ONE+OTHER NON-ACETONE NAIL POLISH REMOVER,53,Cosmetics,34,year(s),Female,"Blister, Chemical burn, Dry skin, Skin exfoliation",Other Outcome
3/27/2023,2023-CFS-003322,1/1/2022,SUSPECT,JUST FOR MEN,53,Cosmetics,54,year(s),Male,Cyst,Other Outcome
3/27/2023,2023-CFS-003320,3/26/2023,SUSPECT,PERFUME,53,Cosmetics,30,year(s),Male,Migraine,Other Outcome
3/27/2023,2023-CFS-003320,3/26/2023,CONCOMITANT,Vit. D,54,Vit/Min/Prot/Unconv Diet(Human/Animal),30,year(s),Male,Migraine,Other Outcome
3/27/2023,2023-CFS-003315,3/16/2022,SUSPECT,JERGENS ULTRA HEALING,53,Cosmetics,16,year(s),Female,Rash,Other Outcome
3/27/2023,2023-CFS-003303,,SUSPECT,TRACE MINERALS RESEARCH LIQUID IONIC IODINE,54,Vit/Min/Prot/Unconv Diet(Human/Animal),58,year(s),Male,"Atrial fibrillation, Hyperthyroidism, Palpitations, Thyroiditis","Visited Emergency Room, Other Serious Outcome"
3/27/2023,2023-CFS-003298,3/11/2023,SUSPECT,NATURE'S BOUNTY BLACK COHOSH,54,Vit/Min/Prot/Unconv Diet(Human/Animal),53,year(s),Female,"Blindness, Dizziness, Hypertension",Other Serious Outcome
3/27/2023,2023-CFS-003298,3/11/2023,CONCOMITANT,unspecified multivitamin for women of over 50 ,54,Vit/Min/Prot/Unconv Diet(Human/Animal),53,year(s),Female,"Blindness, Dizziness, Hypertension",Other Serious Outcome
3/27/2023,2023-CFS-003295,,SUSPECT,PHILLIPS' LAXATIVE DIETARY SUPPLEMENT,54,Vit/Min/Prot/Unconv Diet(Human/Animal),,,Female,Drug dependence,Other Serious Outcome
3/27/2023,2023-CFS-003294,3/13/2023,SUSPECT,MILK,9,Milk/Butter/Dried Milk Prod,53.8,year(s),Male,"Abdominal pain upper, Diarrhoea","Life Threatening, Other Serious or Important Medical Event"
3/27/2023,2023-CFS-003292,9/16/2022,SUSPECT,KROGER FIBER CAPSULES,54,Vit/Min/Prot/Unconv Diet(Human/Animal),79.6,year(s),Female,"Abdominal pain, Diarrhoea, Flatulence",Other Serious or Important Medical Event
3/27/2023,2023-CFS-003291,3/15/2023,SUSPECT,THE ORIGINAL GRAPE NUTS,5,Cereal Prep/Breakfast Food,52,year(s),Female,"Abdominal distension, Discomfort",Other Serious Outcome
3/27/2023,2023-CFS-003291,3/15/2023,CONCOMITANT,Calcium,54,Vit/Min/Prot/Unconv Diet(Human/Animal),52,year(s),Female,"Abdominal distension, Discomfort",Other Serious Outcome
3/27/2023,2023-CFS-003291,3/15/2023,CONCOMITANT,Multivitamin,54,Vit/Min/Prot/Unconv Diet(Human/Animal),52,year(s),Female,"Abdominal distension, Discomfort",Other Serious Outcome
3/27/2023,2023-CFS-003291,3/15/2023,CONCOMITANT,Vitamin D,54,Vit/Min/Prot/Unconv Diet(Human/Animal),52,year(s),Female,"Abdominal distension, Discomfort",Other Serious Outcome
3/27/2023,2023-CFS-003290,12/10/2021,SUSPECT,EXEMPTION 4,45,Food Additives (Human Use),58,year(s),,"Anaphylactic reaction, Loss of consciousness, Pruritus, Swelling, Urticaria","Life Threatening, Visited a Health Care Provider, Allergic Reaction"
3/27/2023,2023-CFS-003287,7/23/2022,SUSPECT,FAKE LASH KIT,53,Cosmetics,38,year(s),Female,"Blepharospasm, Eye infection, Thermal burns of eye",Visited a Health Care Provider
3/27/2023,2023-CFS-003285,,SUSPECT,CITRACAL PETITES,54,Vit/Min/Prot/Unconv Diet(Human/Animal),,,Female,"Choking, Product use complaint",Other Serious Outcome
3/27/2023,2023-CFS-003280,,SUSPECT,ONE A DAY WOMEN'S,54,Vit/Min/Prot/Unconv Diet(Human/Animal),78,year(s),Female,Foreign body in throat,Other Serious Outcome
3/27/2023,2023-CFS-003276,3/1/2023,SUSPECT,FOOD DYES,45,Food Additives (Human Use),5,year(s),Female,Abnormal behaviour,Other Serious or Important Medical Event